FailedConsole Output

13:22:36 Gestartet durch Benutzer Niklaus Giger
13:22:36 Running as SYSTEM
13:22:37 Baue auf dem Agenten „Elexis-WIndows-10“ (windows) in Arbeitsbereich C:\Jenkins\build\workspace\elexis-uitest-windows
13:22:37 [WS-CLEANUP] Deleting project workspace...
13:22:37 [WS-CLEANUP] Deferred wipeout is used...
13:22:37 [WS-CLEANUP] Done
13:22:37 The recommended git tool is: NONE
13:22:37 No credentials specified
13:22:37 Cloning the remote Git repository
13:22:37 Cloning repository http://github.com/elexis/elexis-uitest.git
13:22:37  > git init C:\Jenkins\build\workspace\elexis-uitest-windows # timeout=10
13:22:38 Fetching upstream changes from http://github.com/elexis/elexis-uitest.git
13:22:38  > git --version # timeout=10
13:22:39  > git --version # 'git version 2.19.2.windows.1'
13:22:39  > git fetch --tags --progress -- http://github.com/elexis/elexis-uitest.git +refs/heads/*:refs/remotes/origin/* # timeout=10
13:22:45  > git config remote.origin.url http://github.com/elexis/elexis-uitest.git # timeout=10
13:22:45  > git config --add remote.origin.fetch +refs/heads/*:refs/remotes/origin/* # timeout=10
13:22:45 Avoid second fetch
13:22:46  > git rev-parse "refs/remotes/origin/master^{commit}" # timeout=10
13:22:46 Checking out Revision 1c3da04e6dc08a9d91cf54678717a17a49abf949 (refs/remotes/origin/master)
13:22:46  > git config core.sparsecheckout # timeout=10
13:22:46  > git checkout -f 1c3da04e6dc08a9d91cf54678717a17a49abf949 # timeout=10
13:22:47 Commit message: "Fix Cornercase for GetPersonalia an Fall_check"
13:22:47  > git rev-list --no-walk 839cb6bf3a8f1dab18298c169fa771ced1732a3a # timeout=10
13:22:48 [elexis-uitest-windows] $ cmd.exe /C "C:\Jenkins\build\tools\hudson.tasks.Maven_MavenInstallation\3.6.0\bin\mvn.cmd -V clean verify -f h2/pom.xml --settings h2/settings.xml -Dsuite2run=SmokeTestSuite && exit %%ERRORLEVEL%%"
13:22:56 Apache Maven 3.6.0 (97c98ec64a1fdfee7767ce5ffb20918da4f719f3; 2018-10-24T20:41:47+02:00)
13:22:56 Maven home: C:\jenkins\build\tools\hudson.tasks.Maven_MavenInstallation\3.6.0\bin\..
13:22:56 Java version: 1.8.0_275, vendor: Amazon.com Inc., runtime: C:\Program Files\Amazon Corretto\jdk1.8.0_275\jre
13:22:56 Default locale: de_CH, platform encoding: Cp1252
13:22:56 OS name: "windows 10", version: "10.0", arch: "amd64", family: "windows"
13:23:02 [INFO] Scanning for projects...
13:23:08 [WARNING] No explicit target runtime environment configuration. Build is platform dependent.
13:23:17 [INFO] Computing target platform for MavenProject: ch.elexis.rcptt:elexis-master:3.9 @ C:\jenkins\build\workspace\elexis-uitest-windows\elexis-master\pom.xml
13:23:21 [INFO] Fetching p2.index from https://download.elexis.info/elexis/master/p2/elexis-3-core/ (172B)
13:23:21 [INFO] Adding repository https://download.elexis.info/elexis/master/p2/elexis-3-core
13:23:22 [INFO] Fetching p2.index from https://download.elexis.info/elexis/master/p2/elexis-3-base/ (172B)
13:23:23 [INFO] Adding repository https://download.elexis.info/elexis/master/p2/elexis-3-base
13:23:23 [INFO] Adding repository https://download.elexis.info/elexis/master/p2/target
13:23:23 [INFO] Resolving dependencies of MavenProject: ch.elexis.rcptt:elexis-master:3.9 @ C:\jenkins\build\workspace\elexis-uitest-windows\elexis-master\pom.xml
13:23:25 [INFO] Resolving class path of MavenProject: ch.elexis.rcptt:elexis-master:3.9 @ C:\jenkins\build\workspace\elexis-uitest-windows\elexis-master\pom.xml
13:23:41 [INFO] ------------------------------------------------------------------------
13:23:41 [INFO] Reactor Build Order:
13:23:41 [INFO] 
13:23:41 [INFO] elexis-master                                       [eclipse-repository]
13:23:41 [INFO] setup                                                              [pom]
13:23:41 [INFO] KernFunktionen                                               [rcpttTest]
13:23:41 [INFO] h2                                                                 [pom]
13:23:41 [INFO] 
13:23:41 [INFO] -------------------< ch.elexis.rcptt:elexis-master >--------------------
13:23:41 [INFO] Building elexis-master 3.9                                         [1/4]
13:23:41 [INFO] -------------------------[ eclipse-repository ]-------------------------
13:23:41 [INFO] 
13:23:41 [INFO] --- maven-clean-plugin:2.5:clean (default-clean) @ elexis-master ---
13:23:42 [INFO] 
13:23:42 [INFO] --- tycho-packaging-plugin:1.7.0:build-qualifier-aggregator (default-build-qualifier-aggregator) @ elexis-master ---
13:23:42 [INFO] The project's OSGi version is 3.9.0
13:23:42 [INFO] 
13:23:42 [INFO] --- maven-clean-plugin:2.5:clean (default-clean-1) @ elexis-master ---
13:23:42 [INFO] 
13:23:42 [INFO] --- maven-resources-plugin:2.4.3:resources (default-resources) @ elexis-master ---
13:23:43 [INFO] Using 'UTF-8' encoding to copy filtered resources.
13:23:43 [INFO] skip non existing resourceDirectory C:\jenkins\build\workspace\elexis-uitest-windows\elexis-master\src\main\resources
13:23:43 [INFO] 
13:23:43 [INFO] --- target-platform-configuration:1.7.0:target-platform (default-target-platform) @ elexis-master ---
13:23:43 [INFO] 
13:23:44 [INFO] --- tycho-p2-publisher-plugin:1.7.0:publish-osgi-ee (default-publish-osgi-ee) @ elexis-master ---
13:23:44 [INFO] Published profile IUs: [a.jre.javase 11.0.0, config.a.jre.javase 11.0.0]
13:23:44 [INFO] Published profile IUs: [a.jre.javase 14.0.0, config.a.jre.javase 14.0.0]
13:23:44 [INFO] 
13:23:44 [INFO] --- tycho-p2-publisher-plugin:1.7.0:publish-products (default-publish-products) @ elexis-master ---
13:23:45 [INFO] 
13:23:45 [INFO] --- tycho-p2-publisher-plugin:1.7.0:publish-categories (default-publish-categories) @ elexis-master ---
13:23:46 [INFO] 
13:23:46 [INFO] --- tycho-p2-publisher-plugin:1.7.0:attach-artifacts (default-attach-artifacts) @ elexis-master ---
13:23:46 [INFO] 
13:23:46 [INFO] --- tycho-p2-repository-plugin:1.7.0:assemble-repository (default-assemble-repository) @ elexis-master ---
13:25:38 [INFO] 
13:25:38 [INFO] --- tycho-p2-repository-plugin:1.7.0:archive-repository (default-archive-repository) @ elexis-master ---
13:25:39 [INFO] Building zip: C:\jenkins\build\workspace\elexis-uitest-windows\elexis-master\target\elexis-master-3.9.zip
13:26:10 [INFO] 
13:26:10 [INFO] --- tycho-p2-director-plugin:1.7.0:materialize-products (materialize-products) @ elexis-master ---
13:26:12 [INFO] Installing product ElexisAllOpenSourceApp for environment win32/win32/x86_64 to C:\jenkins\build\workspace\elexis-uitest-windows\elexis-master\target\products\ElexisAllOpenSourceApp\win32\win32\x86_64
13:26:15 Installing ElexisAllOpenSourceApp 3.9.0.
13:26:15 Installing at.gruber.elexis.mythic22.feature.feature.group 3.0.100.20201021-1138.
13:26:15 Installing at.medevit.elexis.agenda.feature.feature.group 1.0.100.20201126-1518.
13:26:15 Installing at.medevit.elexis.bluemedication.feature.feature.group 1.0.0.20201112-0828.
13:26:15 Installing at.medevit.elexis.cobasmira.feature.feature.group 3.0.100.20181207-1630.
13:26:15 Installing at.medevit.elexis.decision.feature.feature.group 3.0.100.20201112-0828.
13:26:15 Installing at.medevit.elexis.ehc.feature.feature.group 3.3.100.20201118-1351.
13:26:15 Installing at.medevit.elexis.emediplan.feature.feature.group 1.0.100.20201021-1138.
13:26:15 Installing at.medevit.elexis.gdt.defaultfilecp.feature.feature.group 3.1.100.20200901-1213.
13:26:15 Installing at.medevit.elexis.gdt.feature.feature.group 3.1.100.20201021-1502.
13:26:15 Installing at.medevit.elexis.impfplan.feature.feature.group 3.8.0.20201125-1133.
13:26:15 Installing at.medevit.elexis.inbox.feature.feature.group 3.0.100.20201012-1158.
13:26:15 Installing at.medevit.elexis.loinc.feature.feature.group 3.0.100.20200623-0838.
13:26:15 Installing at.medevit.elexis.medietikette.feature.feature.group 3.0.100.20200129-1200.
13:26:15 Installing ch.berchtold.privatrechnung.feature.feature.group 3.0.100.20200904-0740.
13:26:15 Installing ch.docbox.elexis.feature.feature.group 3.0.100.20201118-1351.
13:26:15 Installing ch.elexis.agenda.feature.feature.group 3.2.100.20201126-1518.
13:26:15 Installing ch.elexis.archie.patientstatistik.feature.feature.group 3.0.100.20201019-1344.
13:26:15 Installing ch.elexis.archie.wzw.feature.feature.group 3.0.100.20200820-1354.
13:26:15 Installing ch.elexis.barcode.scanner.feature.feature.group 3.2.100.20201021-1138.
13:26:15 Installing ch.elexis.base.befunde.feature.feature.group 3.0.100.20201218-1528.
13:26:15 Installing ch.elexis.base.ch.feature.feature.group 3.2.100.20201217-2215.
13:26:15 Installing ch.elexis.base.konsextension.bildanzeige.feature.feature.group 3.0.100.20181130-1349.
13:26:15 Installing ch.elexis.base.konsextension.privatnotizen.feature.feature.group 3.0.100.20181130-1343.
13:26:15 Installing ch.elexis.base.messages.feature.feature.group 3.0.100.20201021-1138.
13:26:15 Installing ch.elexis.base.messages.feature.feature.group 3.0.100.20201021-1138.
13:26:15 Installing ch.elexis.base.textplugin.feature.feature.group 3.0.100.20180614-0933.
13:26:15 Installing ch.elexis.base.textplugin.feature.feature.group 3.0.100.20180614-0933.
13:26:15 Installing ch.elexis.buchhaltung.basis.feature.feature.group 3.0.100.20190409-1417.
13:26:15 Installing ch.elexis.connect.afinion.feature.feature.group 3.0.100.20190409-1417.
13:26:15 Installing ch.elexis.connect.mythic.feature.feature.group 3.0.100.20190409-1417.
13:26:15 Installing ch.elexis.connect.reflotron.v2.feature.feature.group 3.0.100.20190409-1417.
13:26:15 Installing ch.elexis.connect.sysmex.feature.feature.group 3.0.100.20200417-1322.
13:26:15 Installing ch.elexis.connector.medicosearch.feature.feature.group 3.0.100.20200901-1213.
13:26:15 Installing ch.elexis.externe_dokumente.feature.feature.group 3.0.100.20200901-1913.
13:26:15 Installing ch.elexis.fop_wrapper.feature.feature.group 3.0.100.20200108-1208.
13:26:15 Installing ch.elexis.global_inbox.feature.feature.group 3.8.0.20201112-0902.
13:26:15 Installing ch.elexis.hl7.message.feature.feature.group 1.0.0.20200831-1449.
13:26:15 Installing ch.elexis.icpc.feature.feature.group 3.2.100.20200501-1250.
13:26:15 Installing ch.elexis.icpc.fire.feature.feature.group 3.2.100.20200901-1213.
13:26:15 Installing ch.elexis.impfplan.feature.feature.group 3.0.100.20191209-0913.
13:26:15 Installing ch.elexis.importer.aeskulap.feature.feature.group 1.0.0.20191209-0913.
13:26:15 Installing ch.elexis.kassenbuch.feature.feature.group 3.2.0.20201203-1605.
13:26:15 Installing ch.elexis.laborimport.analytica.feature.feature.group 3.1.100.20200831-1449.
13:26:15 Installing ch.elexis.laborimport.bioanalytica.feature.feature.group 3.0.100.20190411-1739.
13:26:15 Installing ch.elexis.laborimport.eurolyser.feature.feature.group 3.0.100.20201002-0856.
13:26:15 Installing ch.elexis.laborimport.hl7.allg.feature.feature.group 3.0.100.20200901-1213.
13:26:15 Installing ch.elexis.laborimport.medics.v2.feature.feature.group 3.0.100.20200831-1449.
13:26:15 Installing ch.elexis.laborimport.synlab.feature.feature.group 3.0.100.20190416-1030.
13:26:15 Installing ch.elexis.laborimport.teamw.feature.feature.group 3.1.100.20200831-1449.
13:26:15 Installing ch.elexis.laborimport.viollier.v2.feature.feature.group 3.0.100.20201002-0856.
13:26:15 Installing ch.elexis.laborimport_labtop.feature.feature.group 3.0.100.20180614-0933.
13:26:15 Installing ch.elexis.laborimport_lg1.feature.feature.group 3.0.100.20180614-0933.
13:26:15 Installing ch.elexis.laborimport_rischbern.feature.feature.group 3.0.100.20180614-0933.
13:26:15 Installing ch.elexis.laborimport_rothen.feature.feature.group 3.0.100.20180614-0933.
13:26:15 Installing ch.elexis.laborimport_viollier.feature.feature.group 3.0.100.20180309-1216.
13:26:15 Installing ch.elexis.labororder.lg1.feature.feature.group 1.0.0.20200421-1150.
13:26:15 Installing ch.elexis.molemax.feature.feature.group 3.0.100.20190128-1451.
13:26:15 Installing ch.elexis.notes.feature.feature.group 3.0.100.20190703-2009.
13:26:15 Installing ch.elexis.omnivore.feature.feature.group 3.2.100.20201223-1433.
13:26:15 Installing ch.elexis.privatrechnung.feature.feature.group 3.0.100.20200904-0740.
13:26:15 Installing ch.elexis.base.solr.feature.feature.group 1.0.0.20201222-1550.
13:26:15 Installing ch.elexis.stickynotes.feature.feature.group 3.0.100.20200924-1221.
13:26:15 Installing ch.elexis.support.dbshaker.feature.feature.group 3.0.100.20180309-1216.
13:26:15 Installing ch.gpb.elexis.cst.feature.feature.group 1.0.100.20200924-1221.
13:26:15 Installing ch.itmed.fop.printing.feature.feature.group 1.0.0.20201207-1510.
13:26:15 Installing ch.itmed.lmz.risch.laborder.feature.feature.group 3.7.0.20200901-1213.
13:26:15 Installing ch.medelexis.text.templator.feature.feature.group 3.0.100.20191115-1121.
13:26:15 Installing ch.medshare.connect.abacusjunior.feature.feature.group 3.0.100.20190411-1739.
13:26:15 Installing ch.medshare.elexis_directories.feature.feature.group 3.0.100.20180614-1456.
13:26:15 Installing ch.medshare.mediport.feature.feature.group 3.0.100.20201211-0824.
13:26:15 Installing ch.novcom.elexis.mednet.plugin.feature.feature.group 3.1.100.20201021-1138.
13:26:15 Installing ch.pharmed.phmprescriber.feature.feature.group 3.0.100.20200901-1213.
13:26:15 Installing ch.unibe.iam.scg.archie.feature.feature.group 3.0.100.20200831-1449.
13:26:15 Installing ch.weirich.templator.pages.feature.feature.group 3.0.100.20180309-1216.
13:26:15 Installing com.hilotec.elexis.kgview.feature.feature.group 3.0.100.20201002-0856.
13:26:15 Installing com.hilotec.elexis.messwerte.v2.feature.feature.group 3.0.100.20200901-1213.
13:26:15 Installing com.hilotec.elexis.opendocument.feature.feature.group 3.7.0.20190412-2013.
13:26:15 Installing at.medevit.medelexis.text.msword.feature.feature.group 3.8.0.20200611-1324.
13:26:16 Installing ch.medelexis.openoffice.feature.feature.group 3.8.0.20200611-1247.
13:26:16 Installing com.hilotec.elexis.opendocument2omnivore.feature.feature.group 3.0.100.20190430-1127.
13:26:16 Installing com.hilotec.elexis.pluginstatistiken.feature.feature.group 3.0.100.20201203-1126.
13:26:16 Installing com.hilotec.elexis.stickerprefix.feature.feature.group 3.0.100.20181207-1630.
13:26:16 Installing com.hilotec.elexis.toolbar.feature.feature.group 3.8.0.20201109-1555.
13:26:16 Installing net.medshare.connector.aerztekasse.feature.feature.group 3.0.100.20201002-0856.
13:26:16 Installing net.medshare.connector.viollier.feature.feature.group 3.0.100.20201010-1213.
13:26:16 Installing org.iatrix.bestellung.rose.feature.feature.group 3.0.100.20200904-0740.
13:26:16 Installing org.iatrix.messwerte.feature.feature.group 3.0.100.20201118-1351.
13:26:16 Installing at.medbits.elexis.labbit.feature.feature.group 1.0.0.20200226-1024.
13:26:16 Installing org.eclipse.rcp.feature.group 4.15.0.v20200305-0155.
13:26:16 Installing org.eclipse.emf.common.feature.group 2.18.0.v20191225-1014.
13:26:16 Installing org.eclipse.emf.ecore.feature.group 2.21.0.v20200127-1342.
13:26:16 Installing org.eclipse.e4.rcp.feature.group 4.15.0.v20200304-0601.
13:26:16 Installing ch.elexis.core.application.feature.feature.group 3.9.0.20201207-1452.
13:26:16 Installing ch.elexis.core.common.feature.feature.group 3.9.0.20201218-1528.
13:26:16 Installing ch.elexis.core.logging.feature.feature.group 3.9.0.20200226-0838.
13:26:16 Installing ch.elexis.core.persistence.feature.feature.group 1.0.0.20201214-1139.
13:26:16 Installing ch.elexis.core.spotlight.feature.feature.group 1.0.0.20201218-0946.
13:26:16 Installing ch.elexis.core.tasks.feature.feature.group 1.0.0.20201216-1221.
13:26:16 Installing ch.elexis.core.ui.chromium.feature.feature.group 1.0.0.20200517-2227.
13:26:16 Installing ch.elexis.core.ui.eenv.feature.feature.group 1.0.0.20200525-0930.
13:26:16 Installing ch.elexis.core.ui.feature.feature.group 3.9.0.20201218-1528.
13:26:16 Installing ch.elexis.core.ui.p2.feature.feature.group 3.9.0.20200226-0838.
13:26:16 Installing ch.elexis.jre.feature.feature.group 3.9.0.20200728-1155.
13:27:45 Operation completed in 91136 ms.
13:27:46 [INFO] 
13:27:46 [INFO] --- tycho-p2-director-plugin:1.7.0:archive-products (archive-products) @ elexis-master ---
13:27:48 [INFO] Building zip: C:\jenkins\build\workspace\elexis-uitest-windows\elexis-master\target\products\ElexisAllOpenSourceApp-win32.win32.x86_64.zip
13:28:28 [INFO] 
13:28:28 [INFO] -----------------------< ch.elexis.rcptt:setup >------------------------
13:28:28 [INFO] Building setup 0.1                                                 [2/4]
13:28:28 [INFO] --------------------------------[ pom ]---------------------------------
13:28:28 [INFO] 
13:28:28 [INFO] --- maven-clean-plugin:2.4.1:clean (default-clean) @ setup ---
13:28:28 [INFO] Deleting C:\Users\nikla\elexis (includes = [elexislock.*, localCfg*rcptt*xml, localCfg_default.xml], excludes = [])
13:28:28 [INFO] Deleting C:\Users\nikla\elexis\extern (includes = [], excludes = [])
13:28:28 [INFO] Deleting C:\Users\nikla\elexis\logs (includes = [], excludes = [])
13:28:28 [INFO] Deleting C:\Users\nikla\elexis\rcptt (includes = [], excludes = [])
13:28:31 [INFO] Deleting C:\Users\nikla\elexis\h2_elexis_rcptt_de (includes = [], excludes = [])
13:28:31 [INFO] 
13:28:31 [INFO] --- maven-antrun-plugin:1.8:run (copy-datafiles) @ setup ---
13:28:32 [INFO] Executing tasks
13:28:32 
13:28:32 main:
13:28:32      [copy] Copying 1 file to C:\Users\nikla\elexis\rcptt
13:28:32      [copy] Copying 1 file to C:\Users\nikla\elexis\rcptt
13:28:32      [copy] Copying 1 file to C:\Users\nikla\elexis\rcptt
13:28:32      [copy] Copying 1 file to C:\Users\nikla\elexis\rcptt
13:28:32      [copy] Copying 1 file to C:\Users\nikla\elexis\rcptt
13:28:32      [copy] Copying 1 file to C:\Users\nikla\elexis\rcptt
13:28:32      [copy] Copying 1 file to C:\Users\nikla\elexis\rcptt
13:28:32      [copy] Copying 1 file to C:\Users\nikla\elexis\rcptt
13:28:32      [copy] Copying 1 file to C:\Users\nikla\elexis\rcptt
13:28:32      [copy] Copying 1 file to C:\Users\nikla\elexis\extern
13:28:32 [INFO] Executed tasks
13:28:32 [INFO] 
13:28:32 [INFO] --- download-maven-plugin:1.4.1:wget (download-Universal-krankenkasse) @ setup ---
13:28:33 [INFO] Got from cache: C:\Users\nikla\.m2\repository\.cache\download-maven-plugin\Universal_krankenkasse.xls_c288e7dff2ce738af352a93b709ba8ee
13:28:33 [INFO] 
13:28:33 [INFO] --- download-maven-plugin:1.4.1:wget (download-Universal-patienten) @ setup ---
13:28:33 [INFO] Got from cache: C:\Users\nikla\.m2\repository\.cache\download-maven-plugin\Universal_patienten.xls_98f033b19915ff90aa0f1aa4ea0ce769
13:28:33 [INFO] 
13:28:33 [INFO] --- download-maven-plugin:1.4.1:wget (download-ODF-Hilotec-Vorlagen) @ setup ---
13:28:33 [INFO] Got from cache: C:\Users\nikla\.m2\repository\.cache\download-maven-plugin\master.zip_118f755fbfe4d51588edd8c52a340327
13:28:34 [INFO] 
13:28:34 [INFO] --- download-maven-plugin:1.4.1:wget (download-Medelexis-Vorlagen_OpenOffice_Fenster_rechts) @ setup ---
13:28:34 [INFO] Got from cache: C:\Users\nikla\.m2\repository\.cache\download-maven-plugin\Bundle_OpenOffice_Fenster_rechts.zip_e862727d62681b0c7532e81d0d73c7cf
13:28:34 [INFO] 
13:28:34 [INFO] --- download-maven-plugin:1.4.1:wget (download-Medelexis-Vorlagen_OpenOffice_Fenster_links) @ setup ---
13:28:34 [INFO] Got from cache: C:\Users\nikla\.m2\repository\.cache\download-maven-plugin\Bundle_OpenOffice_Fenster_links.zip_89703e11a7d02353a7da1c5fda877aeb
13:28:34 [INFO] 
13:28:35 [INFO] --- download-maven-plugin:1.4.1:wget (download-complementary_24022020) @ setup ---
13:28:35 [INFO] Got from cache: C:\Users\nikla\.m2\repository\.cache\download-maven-plugin\complementary_24022020.csv_c04b57200f57550d598a7c073774dc0d
13:28:35 [INFO] 
13:28:35 [INFO] --- download-maven-plugin:1.4.1:wget (download-MiGeL-01.04.20.xlsx) @ setup ---
13:28:35 [INFO] Got from cache: C:\Users\nikla\.m2\repository\.cache\download-maven-plugin\MiGeL-01.04.20.xlsx_f8ebf8b88d939313bb193cc6e0a3c0f7
13:28:35 [INFO] 
13:28:35 [INFO] --- download-maven-plugin:1.4.1:wget (download-MiGeL-01012019-de) @ setup ---
13:28:35 [INFO] Got from cache: C:\Users\nikla\.m2\repository\.cache\download-maven-plugin\MiGeL-01012019_de.csv_a9e19a9472b39869337bde74b6b23971
13:28:35 [INFO] 
13:28:35 [INFO] --- download-maven-plugin:1.4.1:wget (download-MiGeL-01012019-fr) @ setup ---
13:28:35 [INFO] Got from cache: C:\Users\nikla\.m2\repository\.cache\download-maven-plugin\MiGeL-01012019_fr.csv_676bff6041e4f53a01d0bea4d92d0ba4
13:28:35 [INFO] 
13:28:35 [INFO] --- download-maven-plugin:1.4.1:wget (download-Analyseliste_EAL) @ setup ---
13:28:35 [INFO] Got from cache: C:\Users\nikla\.m2\repository\.cache\download-maven-plugin\EAL_01.04.2020.xlsx_1d80cf14385245dd60ca40d768e65645
13:28:35 [INFO] 
13:28:35 [INFO] --- download-maven-plugin:1.4.1:wget (download-TARMED_01_09_00) @ setup ---
13:28:35 [INFO] Got from cache: C:\Users\nikla\.m2\repository\.cache\download-maven-plugin\TARMED__Datenbank_01.09.00_BR_KVG-27.12.2017.zip_bd87bcc5af197df64dc1425d03586196
13:28:35 [INFO] 
13:28:35 [INFO] --- download-maven-plugin:1.4.1:wget (download-h2-jar) @ setup ---
13:28:36 [INFO] Got from cache: C:\Users\nikla\.m2\repository\.cache\download-maven-plugin\h2-1.4.200.jar_b67743147e0f0825111743bcfde31c5c
13:28:36 [INFO] 
13:28:36 [INFO] --- download-maven-plugin:1.4.1:wget (download-blocks_landarztpraxis_sevelen) @ setup ---
13:28:36 [INFO] Got from cache: C:\Users\nikla\.m2\repository\.cache\download-maven-plugin\blocks_landarztpraxis_sevelen.xchange_90bd58b5cbb43a81d5ab8527c78aec2a
13:28:36 [INFO] 
13:28:36 [INFO] --- download-maven-plugin:1.4.1:wget (download-artikelstamm_01012019_v5) @ setup ---
13:28:37 [INFO] Got from cache: C:\Users\nikla\.m2\repository\.cache\download-maven-plugin\artikelstamm_01012019_v5.xml_0ea1a1b00b8b41bd13668144b84b5961
13:28:42 [INFO] 
13:28:42 [INFO] -------------------< ch.elexis.rcptt:KernFunktionen >-------------------
13:28:42 [INFO] Building KernFunktionen 0.1                                        [3/4]
13:28:42 [INFO] -----------------------------[ rcpttTest ]------------------------------
13:28:43 Downloading from rcptt-snapshots: https://repo.eclipse.org/content/repositories/rcptt-snapshots/org/apache/maven/plugins/maven-install-plugin/maven-metadata.xml
13:28:43 Downloading from rcptt-releases: https://repo.eclipse.org/content/repositories/rcptt-releases/org/apache/maven/plugins/maven-install-plugin/maven-metadata.xml
13:28:44 Downloading from rcptt-releases: https://repo.eclipse.org/content/repositories/rcptt-releases/org/apache/maven/plugins/maven-deploy-plugin/maven-metadata.xml
13:28:44 Downloading from rcptt-snapshots: https://repo.eclipse.org/content/repositories/rcptt-snapshots/org/apache/maven/plugins/maven-deploy-plugin/maven-metadata.xml
13:28:45 [INFO] 
13:28:45 [INFO] --- maven-clean-plugin:2.5:clean (default-clean) @ KernFunktionen ---
13:28:45 [INFO] 
13:28:45 [INFO] --- maven-antrun-plugin:1.8:run (drop-create-database C:\jenkins\build\workspace\elexis-uitest-windows\KernFunktionen/drop_create_db.bat) @ KernFunktionen ---
13:28:46 [INFO] Executing tasks
13:28:46 
13:28:46 main:
13:28:46      [exec] 
13:28:46      [exec] C:\jenkins\build\workspace\elexis-uitest-windows\KernFunktionen>echo No drop/create database needed for h2 
13:28:46      [exec] No drop/create database needed for h2
13:28:46 [INFO] Executed tasks
13:28:46 [INFO] 
13:28:46 [INFO] --- rcptt-maven-plugin:2.5.1:resources (default-resources) @ KernFunktionen ---
13:28:46 Downloading from rcptt-releases: https://repo.eclipse.org/content/repositories/rcptt-releases/org/eclipse/rcptt/runner/rcptt.runner/maven-metadata.xml
13:28:46 Downloading from rcptt-snapshots: https://repo.eclipse.org/content/repositories/rcptt-snapshots/org/eclipse/rcptt/runner/rcptt.runner/maven-metadata.xml
13:28:47 Progress (1): 1.7 kB
Progress (2): 1.7 kB | 436 B
                            
Downloaded from rcptt-releases: https://repo.eclipse.org/content/repositories/rcptt-releases/org/eclipse/rcptt/runner/rcptt.runner/maven-metadata.xml (1.7 kB at 1.8 kB/s)
13:28:47 Downloaded from rcptt-snapshots: https://repo.eclipse.org/content/repositories/rcptt-snapshots/org/eclipse/rcptt/runner/rcptt.runner/maven-metadata.xml (436 B at 439 B/s)
13:28:47 [INFO] version is not specified for RCPTT runner, setting to 2.5.2-SNAPSHOT by default
13:28:47 Downloading from rcptt-releases: https://repo.eclipse.org/content/repositories/rcptt-releases/org/eclipse/rcptt/runner/rcptt.runner/2.5.2-SNAPSHOT/
13:28:47 Downloading from rcptt-snapshots: https://repo.eclipse.org/content/repositories/rcptt-snapshots/org/eclipse/rcptt/runner/rcptt.runner/2.5.2-SNAPSHOT/
13:28:48 Progress (1): 1.2 kB
Progress (1): 4.9 kB
[WARNING] Could not validate integrity of download from https://repo.eclipse.org/content/repositories/rcptt-snapshots/org/eclipse/rcptt/runner/rcptt.runner/2.5.2-SNAPSHOT/: Checksum validation failed, no checksums available
13:28:48                     
[WARNING] Checksum validation failed, no checksums available from rcptt-snapshots for https://repo.eclipse.org/content/repositories/rcptt-snapshots/org/eclipse/rcptt/runner/rcptt.runner/2.5.2-SNAPSHOT/
13:28:48 Downloaded from rcptt-snapshots: https://repo.eclipse.org/content/repositories/rcptt-snapshots/org/eclipse/rcptt/runner/rcptt.runner/2.5.2-SNAPSHOT/ (4.9 kB at 3.2 kB/s)
13:28:48 [INFO] Resolving artifact org.eclipse.rcptt.runner:rcptt.runner:zip:2.5.2-SNAPSHOT, this may take a while ...
13:28:49 Downloading from rcptt-releases: https://repo.eclipse.org/content/repositories/rcptt-releases/org/eclipse/rcptt/runner/rcptt.runner/2.5.2-SNAPSHOT/maven-metadata.xml
13:28:49 Downloading from rcptt-snapshots: https://repo.eclipse.org/content/repositories/rcptt-snapshots/org/eclipse/rcptt/runner/rcptt.runner/2.5.2-SNAPSHOT/maven-metadata.xml
13:28:49 Progress (1): 792 B
                   
Downloaded from rcptt-snapshots: https://repo.eclipse.org/content/repositories/rcptt-snapshots/org/eclipse/rcptt/runner/rcptt.runner/2.5.2-SNAPSHOT/maven-metadata.xml (792 B at 740 B/s)
13:28:50 [INFO] Artifact org.eclipse.rcptt.runner:rcptt.runner:zip:2.5.2-SNAPSHOT is resolved to C:\Users\nikla\.m2\repository\org\eclipse\rcptt\runner\rcptt.runner\2.5.2-SNAPSHOT\rcptt.runner-2.5.2-SNAPSHOT.zip
13:28:50 [INFO] Extracting AUT to C:\jenkins\build\workspace\elexis-uitest-windows\KernFunktionen\target\aut
13:29:43 [INFO] Extracting RCPTT runner to C:\jenkins\build\workspace\elexis-uitest-windows\KernFunktionen\target\runner
13:30:14 [INFO] Copying project contents to target directory...
13:30:16 [INFO] 
13:30:16 [INFO] --- rcptt-maven-plugin:2.5.1:execute (default-execute) @ KernFunktionen ---
13:30:16 [INFO] Runner command line is cmd.exe /X /C ""C:\Program Files\Amazon Corretto\jdk1.8.0_275\jre\bin\java.exe" -Xms128m -Xmx256m -Dorg.eclipse.rcptt.runner.returnTestFailure=true -jar C:\jenkins\build\workspace\elexis-uitest-windows\KernFunktionen\target\runner\eclipse\plugins\org.eclipse.equinox.launcher_1.5.700.v20200207-2156.jar -application org.eclipse.rcptt.runner.headless -runnerPlatform swt -data C:\jenkins\build\workspace\elexis-uitest-windows\KernFunktionen\target\runner-workspace -aut C:\jenkins\build\workspace\elexis-uitest-windows\KernFunktionen\target\aut -autWsPrefix C:\jenkins\build\workspace\elexis-uitest-windows\KernFunktionen\target\aut-ws- -autConsolePrefix C:\jenkins\build\workspace\elexis-uitest-windows\KernFunktionen\target\results\aut-console- -autVMArgs -Djava.library.path=/usr/lib/jni;-DGTK_IM_MODULE=ibus;-Dlanguage=de;-Duser.language=de;-Dch.elexis.dbFlavor=h2;-Dch.elexis.dbSpec=jdbc:h2:C:\Users\nikla/elexis/h2_elexis_rcptt_de/db;-Dch.elexis.dbUser=sa;-Dch.elexis.dbPw=;-Dch.elexis.firstMandantName=Mustermann;-Dch.elexis.firstMandantPassword=elexisTest;-Dch.elexis.firstMandantEmail=mmustermann@elexis.info;-Dch.elexis.username=Mustermann;-Dch.elexis.password=elexisTest;-DvmArg10 -autArgs -nl;de_CH;-nosplash;-noregtool;--use-config=rpctt -q7report C:\jenkins\build\workspace\elexis-uitest-windows\KernFunktionen\target\results\KernFunktionen.report -htmlReport C:\jenkins\build\workspace\elexis-uitest-windows\KernFunktionen\target\results\KernFunktionen.html -junitReport C:\jenkins\build\workspace\elexis-uitest-windows\KernFunktionen\target\surefire-reports\TEST-KernFunktionen.xml -import C:\jenkins\build\workspace\elexis-uitest-windows\KernFunktionen\target\projects\KernFunktionen -testOptions contextRunnableTimeout=5403000;launchingKillAutOnConnectError=true;passedTestDetails=true;testExecTimeout=5410 -timeout 3600 -shutdownListenerPort 9216 -suites SmokeTestSuite"
13:30:17 [INFO] The execution timeout is set to 3600 seconds
13:30:49 [INFO] Started at Fri Dec 25 13:30:49 CET 2020
13:30:49 [INFO] RCPTT Runner version: 2.5.2
13:30:51 [INFO] com.xored.reporting.passed.test.details set to true
13:30:51 [INFO] launching.kill.aut.on.connect.error set to true
13:30:51 [INFO] context.runnable.timeout set to 5403000
13:30:51 [INFO] Initializing target platform...
13:30:51 [INFO] Begin task: Create AUT configuration
13:30:51 [INFO] progress: Resolving Target Contents...
13:30:51 [INFO] progress: Reading plug-ins
13:31:19 [INFO] progress: Fetching p2.index from platform:/plugin/org.eclipse.rcptt.updates.runtime.e4x/q7/
13:31:19 [INFO] progress: Adding repository platform:///plugin/org.eclipse.rcptt.updates.runtime.e4x/q7/
13:31:20 [INFO] progress: Fetching content.jar from platform:/plugin/org.eclipse.rcptt.updates.runtime.e4x/q7/
13:31:21 [INFO] progress: Fetching p2.index from platform:/plugin/org.eclipse.rcptt.updates.runtime.e4x/q7/
13:31:21 [INFO] progress: Fetching content.jar from platform:/plugin/org.eclipse.rcptt.updates.runtime.e4x/q7/
13:31:21 [INFO] progress: Fetching p2.index from platform:/plugin/org.eclipse.rcptt.updates.runtime.e4x/q7/
13:31:21 [INFO] progress: Fetching artifacts.jar from platform:/plugin/org.eclipse.rcptt.updates.runtime.e4x/q7/
13:31:22 [INFO] progress: The user operation is waiting for background work to complete.
13:31:30 [INFO] progress: Downloading org.antlr.runtime
13:31:30 [INFO] progress: The user operation is waiting for background work to complete.
13:31:46 [INFO] progress: Adding repository platform:///plugin/org.eclipse.rcptt.updates.aspectj.e44x/dependencies/
13:31:46 [INFO] progress: Fetching content.jar from platform:/plugin/org.eclipse.rcptt.updates.aspectj.e44x/dependencies/
13:31:46 [INFO] progress: Fetching artifacts.jar from platform:/plugin/org.eclipse.rcptt.updates.aspectj.e44x/dependencies/
13:31:46 [INFO] progress: Downloading org.aspectj.runtime
13:31:46 [INFO] progress: Downloading org.eclipse.equinox.weaving.hook
13:31:46 [INFO] progress: Downloading org.eclipse.equinox.weaving.aspectj
13:31:46 [INFO] progress: Downloading org.aspectj.weaver
13:31:47 [INFO] progress: The user operation is waiting for background work to complete.
13:31:48 [INFO] progress: Adding repository platform:///plugin/org.eclipse.rcptt.updates.kepler/dependencies/
13:31:48 [INFO] progress: Fetching content.jar from platform:/plugin/org.eclipse.rcptt.updates.kepler/dependencies/
13:31:48 [INFO] progress: Fetching artifacts.jar from platform:/plugin/org.eclipse.rcptt.updates.kepler/dependencies/
13:31:48 [INFO] progress: Downloading org.eclipse.emf.converter
13:31:48 [INFO] progress: The user operation is waiting for background work to complete.
13:31:48 [INFO] progress: Downloading org.eclipse.emf.mapping.ecore2ecore
13:31:48 [INFO] progress: Downloading org.eclipse.emf.ecore.change
13:31:48 [INFO] progress: Downloading org.eclipse.emf.transaction.ui
13:31:48 [INFO] progress: The user operation is waiting for background work to complete.
13:31:48 [INFO] progress: Downloading org.eclipse.emf.validation
13:31:48 [INFO] progress: Downloading org.eclipse.emf.codegen.ecore
13:31:48 [INFO] progress: Downloading org.eclipse.emf.mapping.ecore.editor
13:31:48 [INFO] progress: The user operation is waiting for background work to complete.
13:31:48 [INFO] progress: Downloading org.eclipse.emf.validation_root
13:31:48 [INFO] progress: The user operation is waiting for background work to complete.
13:31:48 [INFO] progress: Downloading org.eclipse.emf
13:31:48 [INFO] progress: The user operation is waiting for background work to complete.
13:31:48 [INFO] progress: Downloading org.eclipse.emf.ecore.change.edit
13:31:48 [INFO] progress: The user operation is waiting for background work to complete.
13:31:48 [INFO] progress: Downloading org.eclipse.emf.importer.ecore
13:31:48 [INFO] progress: The user operation is waiting for background work to complete.
13:31:48 [INFO] progress: Downloading org.eclipse.emf.codegen.ui
13:31:48 [INFO] progress: Downloading org.eclipse.emf.mapping.ecore2ecore.editor
13:31:48 [INFO] progress: The user operation is waiting for background work to complete.
13:31:49 [INFO] progress: Downloading org.eclipse.emf.ecore.xmi
13:31:49 [INFO] progress: The user operation is waiting for background work to complete.
13:31:49 [INFO] progress: Downloading org.eclipse.emf.mapping.ui
13:31:49 [INFO] progress: The user operation is waiting for background work to complete.
13:31:49 [INFO] progress: Downloading org.eclipse.emf.databinding.edit
13:31:49 [INFO] progress: The user operation is waiting for background work to complete.
13:31:49 [INFO] progress: Downloading org.eclipse.emf.mapping
13:31:49 [INFO] progress: The user operation is waiting for background work to complete.
13:31:49 [INFO] progress: Downloading org.eclipse.emf.ecore
13:31:49 [INFO] progress: The user operation is waiting for background work to complete.
13:31:49 [INFO] progress: Downloading org.eclipse.emf.codegen.ecore.ui
13:31:49 [INFO] progress: The user operation is waiting for background work to complete.
13:31:49 [INFO] progress: Downloading org.eclipse.emf.importer
13:31:52 [INFO] progress: The user operation is waiting for background work to complete.
13:31:52 [INFO] progress: Downloading org.eclipse.emf.mapping.ecore2xml.ui
13:31:53 [INFO] progress: The user operation is waiting for background work to complete.
13:31:53 [INFO] progress: Downloading org.eclipse.emf.databinding
13:31:53 [INFO] progress: The user operation is waiting for background work to complete.
13:31:53 [INFO] progress: Downloading org.eclipse.emf
13:31:53 [INFO] progress: The user operation is waiting for background work to complete.
13:31:53 [INFO] progress: Downloading org.eclipse.emf.ecore.edit
13:31:53 [INFO] progress: The user operation is waiting for background work to complete.
13:31:53 [INFO] progress: Downloading org.eclipse.emf.validation.ui
13:31:53 [INFO] progress: The user operation is waiting for background work to complete.
13:31:53 [INFO] progress: Downloading org.eclipse.emf.databinding
13:31:53 [INFO] progress: The user operation is waiting for background work to complete.
13:31:53 [INFO] progress: Downloading org.eclipse.emf.transaction
13:31:53 [INFO] progress: The user operation is waiting for background work to complete.
13:31:53 [INFO] progress: Downloading org.eclipse.emf.ecore.editor
13:31:53 [INFO] progress: The user operation is waiting for background work to complete.
13:31:53 [INFO] progress: Downloading org.eclipse.emf.codegen.ecore
13:31:53 [INFO] progress: The user operation is waiting for background work to complete.
13:31:53 [INFO] progress: Downloading org.eclipse.emf.common.ui
13:31:53 [INFO] progress: The user operation is waiting for background work to complete.
13:31:53 [INFO] progress: Downloading org.eclipse.emf.mapping.ecore2xml
13:31:53 [INFO] progress: The user operation is waiting for background work to complete.
13:31:53 [INFO] progress: Downloading org.eclipse.emf.mapping.ecore
13:31:53 [INFO] progress: The user operation is waiting for background work to complete.
13:31:53 [INFO] progress: Downloading org.eclipse.emf.ecore
13:31:53 [INFO] progress: Downloading org.eclipse.emf.mapping
13:31:53 [INFO] progress: The user operation is waiting for background work to complete.
13:31:53 [INFO] progress: Downloading org.eclipse.emf.edit.ui
13:31:53 [INFO] progress: The user operation is waiting for background work to complete.
13:31:53 [INFO] progress: Downloading org.eclipse.emf.exporter
13:31:53 [INFO] progress: The user operation is waiting for background work to complete.
13:31:53 [INFO] progress: Downloading org.eclipse.emf.mapping.ui
13:31:53 [INFO] progress: The user operation is waiting for background work to complete.
13:31:53 [INFO] progress: Downloading org.eclipse.emf.converter
13:31:53 [INFO] progress: The user operation is waiting for background work to complete.
13:31:53 [INFO] progress: Downloading org.eclipse.emf.transaction
13:31:53 [INFO] progress: The user operation is waiting for background work to complete.
13:31:53 [INFO] progress: Downloading org.eclipse.emf.transaction_root
13:31:53 [INFO] progress: The user operation is waiting for background work to complete.
13:31:53 [INFO] progress: Downloading org.eclipse.emf.databinding.edit
13:31:53 [INFO] progress: The user operation is waiting for background work to complete.
13:31:54 [INFO] progress: Downloading org.eclipse.emf.ecore.edit
13:31:54 [INFO] progress: The user operation is waiting for background work to complete.
13:31:54 [INFO] progress: Downloading org.eclipse.emf.validation
13:31:54 [INFO] progress: The user operation is waiting for background work to complete.
13:31:54 [INFO] progress: Downloading org.eclipse.emf.importer.rose
13:31:54 [INFO] progress: The user operation is waiting for background work to complete.
13:31:54 [INFO] progress: Downloading org.eclipse.emf.edit.ui
13:31:54 [INFO] progress: The user operation is waiting for background work to complete.
13:31:54 [INFO] progress: Downloading org.eclipse.emf.ant
13:31:54 [INFO] progress: The user operation is waiting for background work to complete.
13:31:54 [INFO] progress: Downloading org.eclipse.emf.importer.java
13:31:54 [INFO] progress: The user operation is waiting for background work to complete.
13:31:54 [INFO] progress: Downloading org.eclipse.emf.codegen.ecore.ui
13:31:54 [INFO] progress: The user operation is waiting for background work to complete.
13:31:54 [INFO] progress: Downloading org.eclipse.emf.edit
13:31:54 [INFO] progress: The user operation is waiting for background work to complete.
13:31:54 [INFO] progress: Downloading org.eclipse.emf.common.ui
13:31:54 [INFO] progress: The user operation is waiting for background work to complete.
13:31:54 [INFO] progress: Downloading org.eclipse.emf.codegen
13:31:54 [INFO] progress: The user operation is waiting for background work to complete.
13:31:54 [INFO] progress: Downloading org.eclipse.emf.common
13:31:54 [INFO] progress: The user operation is waiting for background work to complete.
13:31:54 [INFO] progress: Downloading org.eclipse.emf.ecore.editor
13:31:54 [INFO] progress: The user operation is waiting for background work to complete.
13:31:54 [INFO] progress: Downloading org.eclipse.emf.mapping.ecore
13:31:54 [INFO] progress: The user operation is waiting for background work to complete.
13:31:54 [INFO] progress: Downloading org.eclipse.emf.mapping.ecore.editor
13:31:54 [INFO] progress: The user operation is waiting for background work to complete.
13:31:54 [INFO] progress: Downloading org.eclipse.emf.validation.ui.ide
13:31:54 [INFO] progress: Downloading org.eclipse.emf.common
13:31:54 [INFO] progress: The user operation is waiting for background work to complete.
13:31:54 [INFO] progress: Downloading org.eclipse.emf.edit
13:31:54 [INFO] progress: The user operation is waiting for background work to complete.
13:31:55 [INFO] progress: Downloading org.eclipse.emf.codegen
13:31:55 [INFO] progress: Downloading org.eclipse.emf.codegen.ui
13:31:55 [INFO] progress: The user operation is waiting for background work to complete.
13:31:58 [INFO] progress: Adding repository platform:///plugin/org.eclipse.rcptt.module.nebula.updates/runtime/
13:31:58 [INFO] progress: Fetching content.jar from platform:/plugin/org.eclipse.rcptt.module.nebula.updates/runtime/
13:31:58 [INFO] progress: Fetching artifacts.jar from platform:/plugin/org.eclipse.rcptt.module.nebula.updates/runtime/
13:31:58 [INFO] progress: The user operation is waiting for background work to complete.
13:31:59 [INFO] progress: Adding repository platform:///plugin/org.eclipse.rcptt.module.testrail.updates/runtime/
13:31:59 [INFO] progress: Fetching content.jar from platform:/plugin/org.eclipse.rcptt.module.testrail.updates/runtime/
13:31:59 [INFO] progress: Fetching artifacts.jar from platform:/plugin/org.eclipse.rcptt.module.testrail.updates/runtime/
13:32:00 [INFO] progress: The user operation is waiting for background work to complete.
13:32:00 [INFO] progress: Adding repository platform:///plugin/org.eclipse.rcptt.updates.extra/dependencies/
13:32:00 [INFO] progress: Fetching content.jar from platform:/plugin/org.eclipse.rcptt.updates.extra/dependencies/
13:32:00 [INFO] progress: Fetching artifacts.jar from platform:/plugin/org.eclipse.rcptt.updates.extra/dependencies/
13:32:01 [INFO] progress: Downloading org.apache.poi.ooxml
13:32:01 [INFO] progress: Downloading org.apache.xmlbeans
13:32:01 [INFO] progress: Downloading org.apache.poi.ooxml.schemas
13:32:01 [INFO] progress: Downloading org.dom4j
13:32:01 [INFO] progress: The user operation is waiting for background work to complete.
13:32:01 [INFO] progress: Downloading org.apache.poi
13:32:01 [INFO] progress: The user operation is waiting for background work to complete.
13:32:03 [INFO] progress: Resolving Target Contents...
13:32:03 [INFO] progress: Reading plug-ins
13:32:03 [INFO] progress: Fetching p2.index from platform:/plugin/org.eclipse.rcptt.updates.runtime.e4x/q7/
13:32:03 [INFO] progress: Fetching content.jar from platform:/plugin/org.eclipse.rcptt.updates.runtime.e4x/q7/
13:32:04 [INFO] progress: Fetching content.jar from platform:/plugin/org.eclipse.rcptt.updates.aspectj.e44x/dependencies/
13:32:04 [INFO] progress: Fetching content.jar from platform:/plugin/org.eclipse.rcptt.updates.kepler/dependencies/
13:32:04 [INFO] progress: Fetching content.jar from platform:/plugin/org.eclipse.rcptt.module.nebula.updates/runtime/
13:32:04 [INFO] progress: Fetching content.jar from platform:/plugin/org.eclipse.rcptt.module.testrail.updates/runtime/
13:32:04 [INFO] progress: Fetching content.jar from platform:/plugin/org.eclipse.rcptt.updates.extra/dependencies/
13:32:05 [INFO] progress: Fetching p2.index from platform:/plugin/org.eclipse.rcptt.updates.runtime.e4x/q7/
13:32:05 [INFO] progress: Fetching artifacts.jar from platform:/plugin/org.eclipse.rcptt.updates.runtime.e4x/q7/
13:32:05 [INFO] progress: Fetching artifacts.jar from platform:/plugin/org.eclipse.rcptt.module.testrail.updates/runtime/
13:32:06 [INFO] progress: Fetching artifacts.jar from platform:/plugin/org.eclipse.rcptt.updates.kepler/dependencies/
13:32:06 [INFO] progress: Fetching artifacts.jar from platform:/plugin/org.eclipse.rcptt.module.nebula.updates/runtime/
13:32:06 [INFO] progress: Fetching artifacts.jar from platform:/plugin/org.eclipse.rcptt.updates.aspectj.e44x/dependencies/
13:32:06 [INFO] progress: Fetching artifacts.jar from platform:/plugin/org.eclipse.rcptt.updates.extra/dependencies/
13:32:06 [INFO] progress: Downloading org.eclipse.emf.validation_root
13:32:06 [INFO] progress: Downloading org.eclipse.emf.transaction_root
13:32:06 [INFO] progress: Installing org.eclipse.rcptt.ctx.script
13:32:06 [INFO] progress: Installing org.eclipse.rcptt.ctx.parameters.impl
13:32:06 [INFO] progress: Installing org.eclipse.emf.ecore.change
13:32:06 [INFO] progress: Installing org.eclipse.rcptt.ecl.server.feature.jar
13:32:06 [INFO] progress: Installing org.eclipse.rcptt.ctx.filesystem
13:32:06 [INFO] progress: Installing org.eclipse.rcptt.tesla.recording.draw2d
13:32:06 [INFO] progress: Installing org.eclipse.rcptt.ecl.doc
13:32:06 [INFO] progress: Installing org.eclipse.rcptt.ecl.parser
13:32:06 [INFO] progress: Installing org.eclipse.rcptt.tesla.recording.core.ecl
13:32:06 [INFO] progress: Installing org.eclipse.rcptt.tesla.runtime.feature.group
13:32:06 [INFO] progress: Installing org.eclipse.rcptt.tesla.gmf
13:32:06 [INFO] progress: Installing org.eclipse.emf.ecore.xmi
13:32:06 [INFO] progress: Installing org.eclipse.emf.mapping.feature.jar
13:32:06 [INFO] progress: Installing org.dom4j
13:32:06 [INFO] progress: Installing org.eclipse.rcptt.ctx.preferences.impl
13:32:06 [INFO] progress: Installing org.eclipse.rcptt.watson.aspects.jobs
13:32:06 [INFO] progress: Installing org.eclipse.rcptt.reporting
13:32:06 [INFO] progress: Installing org.eclipse.emf.importer
13:32:06 [INFO] progress: Installing org.eclipse.emf.mapping.ecore2xml.ui
13:32:06 [INFO] progress: Installing org.eclipse.rcptt.core.scenario
13:32:06 [INFO] progress: Installing org.eclipse.rcptt.runtime.feature.jar
13:32:06 [INFO] progress: Installing org.eclipse.rcptt.ctx.group
13:32:06 [INFO] progress: Installing org.eclipse.rcptt.ctx.preferences.aspects
13:32:06 [INFO] progress: Installing org.eclipse.emf.ecore.edit
13:32:06 [INFO] progress: Installing org.eclipse.emf.edit.feature.group
13:32:06 [INFO] progress: Installing org.eclipse.emf.transaction
13:32:06 [INFO] progress: Installing org.eclipse.rcptt.ecl.platform.feature.group
13:32:06 [INFO] progress: Installing org.eclipse.rcptt.tesla.jdt.aspects
13:32:06 [INFO] progress: Installing org.eclipse.emf.codegen.ecore.feature.jar
13:32:06 [INFO] progress: Installing org.eclipse.emf.mapping.ecore.editor.feature.group
13:32:06 [INFO] progress: Installing org.eclipse.emf.common.ui.feature.jar
13:32:06 [INFO] progress: Installing org.eclipse.rcptt.ctx.workbench.impl
13:32:06 [INFO] progress: Installing org.eclipse.rcptt.verifications.resources.impl
13:32:06 [INFO] progress: Installing org.eclipse.rcptt.tesla.core
13:32:06 [INFO] progress: Installing org.eclipse.rcptt.ecl.client.tcp
13:32:06 [INFO] progress: Installing org.eclipse.rcptt.tesla.workbench.aspects.e4x
13:32:06 [INFO] progress: Installing org.eclipse.emf.ecore.edit.feature.group
13:32:06 [INFO] progress: Installing org.eclipse.rcptt.ecl.platform.ui.feature.group
13:32:06 [INFO] progress: Installing org.eclipse.rcptt.tesla.workbench.texteditor
13:32:06 [INFO] progress: Installing org.eclipse.rcptt.tesla.ecl.impl
13:32:06 [INFO] progress: Installing org.eclipse.rcptt.tesla.ecl.runtime.feature.jar
13:32:06 [INFO] progress: Installing org.eclipse.rcptt.resources
13:32:06 [INFO] progress: Installing org.eclipse.rcptt.tesla.gmf.aspects
13:32:06 [INFO] progress: Installing org.eclipse.rcptt.tesla.core.context
13:32:06 [INFO] progress: Installing org.eclipse.rcptt.tesla.nebula.impl
13:32:06 [INFO] progress: Installing org.eclipse.emf.transaction.feature.jar
13:32:06 [INFO] progress: Installing org.eclipse.rcptt.tesla.jobs.aspects
13:32:06 [INFO] progress: Installing org.eclipse.rcptt.module.nebula.runtime.feature.group
13:32:06 [INFO] progress: Installing org.eclipse.rcptt.watson.runtime.feature.jar
13:32:06 [INFO] progress: Installing org.eclipse.rcptt.ctx.group.impl
13:32:06 [INFO] progress: Installing org.eclipse.rcptt.tesla.core.am
13:32:06 [INFO] progress: Installing org.eclipse.rcptt.tesla.runtime.feature.jar
13:32:06 [INFO] progress: Installing org.eclipse.emf.ecore.edit.feature.jar
13:32:06 [INFO] progress: Installing org.eclipse.emf.validation
13:32:06 [INFO] progress: Installing org.eclipse.rcptt.watson.aspects.swt
13:32:07 [INFO] progress: Installing org.eclipse.rcptt.tesla.ecl
13:32:07 [INFO] progress: Installing org.eclipse.emf.edit.ui
13:32:07 [INFO] progress: Installing org.eclipse.rcptt.tesla.canvas
13:32:07 [INFO] progress: Installing org.eclipse.emf.edit.feature.jar
13:32:07 [INFO] progress: Installing org.eclipse.equinox.weaving.aspectj
13:32:07 [INFO] progress: Installing org.eclipse.rcptt.tesla.swt.e4x
13:32:07 [INFO] progress: Installing org.eclipse.emf.validation.ui.ide
13:32:07 [INFO] progress: Installing org.eclipse.emf.edit
13:32:07 [INFO] progress: Installing org.eclipse.rcptt.ctx.debug
13:32:07 [INFO] progress: Installing org.eclipse.rcptt.tesla.jface.databinding
13:32:07 [INFO] progress: Installing config.a.jre.javase
13:32:07 [INFO] progress: Installing org.eclipse.rcptt.tesla.recording.aspects.jface.text
13:32:07 [INFO] progress: Installing file:/home/jenkins/agent/workspace/master/modules/testrail/runtime-site/target/site/site.xml.rcptt
13:32:07 [INFO] progress: Installing org.eclipse.rcptt.verifications.tree
13:32:07 [INFO] progress: Installing org.eclipse.emf.converter.feature.group
13:32:07 [INFO] progress: Installing org.eclipse.emf.databinding.edit.feature.group
13:32:07 [INFO] progress: Installing org.eclipse.emf.transaction.ui
13:32:07 [INFO] progress: Installing org.eclipse.emf.validation.feature.jar
13:32:07 [INFO] progress: Installing org.eclipse.emf.codegen.ecore
13:32:07 [INFO] progress: Installing org.eclipse.rcptt.tesla.ecl.runtime.feature.group
13:32:07 [INFO] progress: Installing org.eclipse.rcptt.core
13:32:07 [INFO] progress: Installing org.eclipse.rcptt.tesla.nebula.ecl.impl
13:32:07 [INFO] progress: Installing org.eclipse.rcptt.tesla.jface.text
13:32:07 [INFO] progress: Installing org.eclipse.emf.common.ui.feature.group
13:32:07 [INFO] progress: Installing org.apache.poi.ooxml.schemas
13:32:07 [INFO] progress: Installing org.eclipse.rcptt.tesla.ui.ide
13:32:07 [INFO] progress: Installing org.eclipse.rcptt.tesla.jface.text.reconciler.aspects
13:32:07 [INFO] progress: Installing org.eclipse.emf.ecore.change.edit
13:32:07 [INFO] progress: Installing org.eclipse.emf.mapping.ecore2ecore.editor
13:32:07 [INFO] progress: Installing org.eclipse.rcptt.forms.impl
13:32:07 [INFO] progress: Installing org.antlr.runtime
13:32:07 [INFO] progress: Installing org.eclipse.rcptt.tesla.ecl.feature.group
13:32:07 [INFO] progress: Installing org.eclipse.rcptt.tesla.jface.text.aspects
13:32:07 [INFO] progress: Installing org.eclipse.emf.databinding.edit
13:32:07 [INFO] progress: Installing org.eclipse.rcptt.watson.feature.jar
13:32:07 [INFO] progress: Installing org.eclipse.rcptt.ctx.parameters
13:32:07 [INFO] progress: Installing org.eclipse.emf.edit.ui.feature.group
13:32:07 [INFO] progress: Installing org.eclipse.rcptt.ctx.resources.impl
13:32:07 [INFO] progress: Installing org.eclipse.rcptt.verifications.resources
13:32:07 [INFO] progress: Installing org.eclipse.rcptt.tesla.swt.fragment
13:32:07 [INFO] progress: Installing org.eclipse.emf
13:32:07 [INFO] progress: Installing org.eclipse.rcptt.ecl.server.tcp
13:32:07 [INFO] progress: Installing org.eclipse.rcptt.tesla.recording.core
13:32:07 [INFO] progress: Installing org.eclipse.rcptt.tesla.properties.view
13:32:07 [INFO] progress: Installing org.eclipse.rcptt.testrail.ecl
13:32:07 [INFO] progress: Installing org.eclipse.emf.validation.ui
13:32:07 [INFO] progress: Installing org.eclipse.rcptt.tesla.recording.aspects.swt
13:32:07 [INFO] progress: Installing org.eclipse.emf.codegen.ecore.feature.group
13:32:07 [INFO] progress: Installing org.apache.xmlbeans
13:32:07 [INFO] progress: Installing org.eclipse.rcptt.logging
13:32:07 [INFO] progress: Installing org.eclipse.rcptt.tesla.jface.fragment
13:32:07 [INFO] progress: Installing org.eclipse.rcptt.tesla.feature.group
13:32:07 [INFO] progress: Installing org.eclipse.emf.mapping.ecore.feature.jar
13:32:07 [INFO] progress: Installing org.eclipse.rcptt.ecl.core
13:32:07 [INFO] progress: Installing org.eclipse.rcptt.core.swt.win64
13:32:07 [INFO] progress: Installing org.eclipse.rcptt.util.resources
13:32:07 [INFO] progress: Installing org.eclipse.emf.mapping.feature.group
13:32:07 [INFO] progress: Installing org.eclipse.equinox.weaving.hook
13:32:07 [INFO] progress: Installing org.eclipse.emf.edit.ui.feature.jar
13:32:07 [INFO] progress: Installing org.eclipse.rcptt.tesla.recording.canvas
13:32:07 [INFO] progress: Installing org.eclipse.emf.mapping.ui
13:32:07 [INFO] progress: Installing org.eclipse.rcptt.tesla.recording.swt
13:32:07 [INFO] progress: Installing org.eclipse.rcptt.ecl.dispatch
13:32:07 [INFO] progress: Installing org.eclipse.rcptt.verifications.tree.impl
13:32:07 [INFO] progress: Installing org.eclipse.rcptt.tesla.recording.aspects.gmf
13:32:07 [INFO] progress: Installing org.eclipse.rcptt.testrail.ecl.impl
13:32:07 [INFO] progress: Installing org.eclipse.rcptt.ctx.filesystem.impl
13:32:07 [INFO] progress: Installing org.eclipse.rcptt.watson.jface
13:32:07 [INFO] progress: Installing org.eclipse.rcptt.runtime.ui
13:32:07 [INFO] progress: Installing org.eclipse.rcptt.tesla.recording.aspects.gef
13:32:07 [INFO] progress: Installing org.eclipse.emf.importer.java
13:32:07 [INFO] progress: Installing org.eclipse.emf.codegen.feature.jar
13:32:07 [INFO] progress: Installing org.eclipse.emf.common
13:32:07 [INFO] progress: Installing org.eclipse.emf.mapping.ecore
13:32:07 [INFO] progress: Installing org.eclipse.emf.mapping.ecore.editor.feature.jar
13:32:07 [INFO] progress: Installing org.eclipse.emf.common.feature.jar
13:32:07 [INFO] progress: Installing org.eclipse.rcptt.tesla.feature.jar
13:32:07 [INFO] progress: Installing org.eclipse.rcptt.verifications.text.impl
13:32:07 [INFO] progress: Installing org.eclipse.emf.mapping.ecore2ecore
13:32:07 [INFO] progress: Installing org.eclipse.rcptt.core.ecl.debug
13:32:07 [INFO] progress: Installing org.eclipse.rcptt.ecl.filesystem
13:32:07 [INFO] progress: Installing org.eclipse.rcptt.resources.impl
13:32:07 [INFO] progress: Installing org.eclipse.emf.mapping.ecore.editor
13:32:07 [INFO] progress: Installing org.eclipse.rcptt.ctx.script.impl
13:32:07 [INFO] progress: Installing org.eclipse.emf.validation_root
13:32:07 [INFO] progress: Installing org.eclipse.emf.feature.jar
13:32:07 [INFO] progress: Installing org.eclipse.rcptt.ecl.core.feature.jar
13:32:07 [INFO] progress: Installing org.eclipse.rcptt.ecl.platform.feature.jar
13:32:07 [INFO] progress: Installing org.eclipse.rcptt.tesla.jdt
13:32:07 [INFO] progress: Installing org.eclipse.emf.importer.ecore
13:32:07 [INFO] progress: Installing org.eclipse.rcptt.tesla.jface.databinding.observable.aspects
13:32:07 [INFO] progress: Installing org.eclipse.emf.codegen.ecore.ui.feature.group
13:32:07 [INFO] progress: Installing org.eclipse.rcptt.module.nebula.runtime.feature.jar
13:32:07 [INFO] progress: Installing org.eclipse.emf.codegen.ecore.ui.feature.jar
13:32:07 [INFO] progress: Installing org.eclipse.rcptt.verifications.text
13:32:07 [INFO] progress: Installing org.eclipse.rcptt.expandbar
13:32:07 [INFO] progress: Installing org.eclipse.rcptt.tesla.recording.gef
13:32:07 [INFO] progress: Installing org.eclipse.rcptt.ecl.interop
13:32:07 [INFO] progress: Installing org.eclipse.rcptt.ecl.platform.ui
13:32:07 [INFO] progress: Installing org.eclipse.rcptt.tesla.ui.ide.aspects
13:32:07 [INFO] progress: Installing org.eclipse.rcptt.runtime.feature.group
13:32:07 [INFO] progress: Installing org.eclipse.rcptt.tesla.recording.gmf
13:32:07 [INFO] progress: Installing org.eclipse.rcptt.tesla.jface.aspects
13:32:07 [INFO] progress: Installing org.eclipse.rcptt.tesla.ecl.feature.jar
13:32:07 [INFO] progress: Installing org.eclipse.emf.feature.group
13:32:07 [INFO] progress: Installing org.eclipse.rcptt.core.launching
13:32:07 [INFO] progress: Installing org.eclipse.emf.mapping.ecore2xml
13:32:07 [INFO] progress: Installing org.eclipse.rcptt.module.testrail.runtime.feature.group
13:32:07 [INFO] progress: Installing org.eclipse.rcptt.tesla.swt.aspects
13:32:07 [INFO] progress: Installing org.eclipse.emf.mapping
13:32:07 [INFO] progress: Installing org.eclipse.rcptt.tesla.workbench.texteditor.aspects
13:32:07 [INFO] progress: Installing org.eclipse.rcptt.ecl.data.apache.poi.impl
13:32:07 [INFO] progress: Installing org.eclipse.rcptt.ctx.debug.impl
13:32:07 [INFO] progress: Installing org.eclipse.emf.exporter
13:32:07 [INFO] progress: Installing org.eclipse.rcptt.verifications.time
13:32:07 [INFO] progress: Installing org.eclipse.emf.converter.feature.jar
13:32:07 [INFO] progress: Installing org.eclipse.rcptt.ctx.workbench
13:32:07 [INFO] progress: Installing org.eclipse.rcptt.tesla.variables
13:32:07 [INFO] progress: Installing org.eclipse.rcptt.tesla.recording.workbench.texteditor
13:32:07 [INFO] progress: Installing org.eclipse.rcptt.watson.core
13:32:07 [INFO] progress: Installing org.eclipse.emf.transaction_root
13:32:07 [INFO] progress: Installing org.eclipse.rcptt.tesla.recording.jface.text
13:32:07 [INFO] progress: Installing org.eclipse.emf.databinding.edit.feature.jar
13:32:07 [INFO] progress: Installing org.eclipse.rcptt.expandbar.runtime
13:32:07 [INFO] progress: Installing org.eclipse.rcptt.tesla.jface.databinding.aspects
13:32:07 [INFO] progress: Installing org.eclipse.rcptt.tesla.gef.aspects
13:32:07 [INFO] progress: Installing org.eclipse.rcptt.tesla.nebula
13:32:07 [INFO] progress: Installing org.eclipse.emf.ant
13:32:07 [INFO] progress: Installing org.aspectj.runtime
13:32:07 [INFO] progress: Installing org.eclipse.emf.codegen.ecore.ui
13:32:07 [INFO] progress: Installing org.eclipse.rcptt.util.swt
13:32:07 [INFO] progress: Installing org.eclipse.rcptt.verifications.time.impl
13:32:07 [INFO] progress: Installing org.eclipse.rcptt.ecl.core.feature.group
13:32:07 [INFO] progress: Installing org.eclipse.rcptt.ecl.platform.ui.feature.jar
13:32:07 [INFO] progress: Installing org.apache.poi
13:32:07 [INFO] progress: Installing org.eclipse.emf.transaction.feature.group
13:32:07 [INFO] progress: Installing org.eclipse.emf.codegen
13:32:07 [INFO] progress: Installing org.eclipse.emf.codegen.ui
13:32:07 [INFO] progress: Installing org.eclipse.rcptt.ecl.debug.runtime
13:32:07 [INFO] progress: Installing org.eclipse.rcptt.util
13:32:07 [INFO] progress: Installing org.eclipse.emf.converter
13:32:07 [INFO] progress: Installing org.eclipse.emf.ecore.feature.group
13:32:07 [INFO] progress: Installing org.eclipse.rcptt.verifications.log.impl
13:32:07 [INFO] progress: Installing 202006170330.Default
13:32:07 [INFO] progress: Installing org.eclipse.emf.mapping.ecore.feature.group
13:32:07 [INFO] progress: Installing org.eclipse.emf.mapping.ui.feature.group
13:32:07 [INFO] progress: Installing org.eclipse.rcptt.ecl.data
13:32:07 [INFO] progress: Installing org.eclipse.rcptt.verifications.log
13:32:07 [INFO] progress: Installing org.eclipse.rcptt.watson.runtime.feature.group
13:32:07 [INFO] progress: Installing org.eclipse.rcptt.tesla.swt
13:32:07 [INFO] progress: Installing org.eclipse.rcptt.tesla.recording.aspects.workbench.texteditor
13:32:07 [INFO] progress: Installing org.eclipse.rcptt.ecl.operations
13:32:07 [INFO] progress: Installing org.eclipse.rcptt.ctx.workbench.aspect
13:32:07 [INFO] progress: Installing org.eclipse.emf.codegen.feature.group
13:32:07 [INFO] progress: Installing a.jre.javase
13:32:07 [INFO] progress: Installing org.eclipse.emf.codegen.ui.feature.jar
13:32:07 [INFO] progress: Installing org.eclipse.emf.ecore.editor.feature.group
13:32:07 [INFO] progress: Installing org.eclipse.rcptt.ctx.resources
13:32:07 [INFO] progress: Installing org.eclipse.emf.mapping.ui.feature.jar
13:32:07 [INFO] progress: Installing org.apache.poi.ooxml
13:32:07 [INFO] progress: Installing org.eclipse.emf.ecore
13:32:07 [INFO] progress: Installing org.eclipse.emf.common.feature.group
13:32:07 [INFO] progress: Installing org.eclipse.rcptt.tesla.recording.aspects.workbench
13:32:07 [INFO] progress: Installing org.eclipse.emf.databinding
13:32:07 [INFO] progress: Installing org.eclipse.rcptt.watson.feature.group
13:32:07 [INFO] progress: Installing org.eclipse.emf.databinding.feature.group
13:32:07 [INFO] progress: Installing org.eclipse.rcptt.ctx.preferences
13:32:07 [INFO] progress: Installing org.eclipse.rcptt.ecl.perf
13:32:07 [INFO] progress: Installing org.eclipse.rcptt.tesla.nebula.ecl
13:32:07 [INFO] progress: Installing org.eclipse.emf.databinding.feature.jar
13:32:07 [INFO] progress: Installing org.eclipse.rcptt.tesla.recording.aspects.forms
13:32:07 [INFO] progress: Installing org.eclipse.emf.ecore.editor.feature.jar
13:32:07 [INFO] progress: Installing org.eclipse.rcptt.tesla.recording.nebula
13:32:07 [INFO] progress: Installing org.eclipse.rcptt.tesla.recording.aspects.draw2d
13:32:08 [INFO] progress: Installing org.eclipse.emf.ecore.feature.jar
13:32:08 [INFO] progress: Installing org.aspectj.weaver
13:32:08 [INFO] progress: Installing file:/home/jenkins/agent/workspace/master/modules/nebula/runtime-site/target/site/site.xml.rcptt
13:32:08 [INFO] progress: Installing org.eclipse.emf.codegen.ui.feature.group
13:32:08 [INFO] progress: Installing org.eclipse.rcptt.module.testrail.runtime.feature.jar
13:32:08 [INFO] progress: Installing org.eclipse.emf.validation.feature.group
13:32:08 [INFO] progress: Installing org.eclipse.rcptt.ecl.platform
13:32:08 [INFO] progress: Installing org.eclipse.rcptt.ecl.server.feature.group
13:32:08 [INFO] progress: Installing org.eclipse.rcptt.tesla.recording.aspects.jface
13:32:08 [INFO] progress: Installing org.eclipse.rcptt.tesla.gef
13:32:08 [INFO] progress: Installing org.eclipse.rcptt.watson.jobs
13:32:08 [INFO] progress: Installing org.eclipse.rcptt.core.swt
13:32:08 [INFO] progress: Installing org.eclipse.rcptt.core.ecl.core
13:32:08 [INFO] progress: Installing org.eclipse.rcptt.ecl.data.apache.poi
13:32:08 [INFO] progress: Installing org.eclipse.emf.importer.rose
13:32:08 [INFO] progress: Installing org.eclipse.emf.common.ui
13:32:08 [INFO] progress: Installing org.eclipse.rcptt.verifications
13:32:08 [INFO] progress: Installing org.eclipse.emf.ecore.editor
13:32:08 [INFO] progress: Downloading org.eclipse.emf.validation_root
13:32:08 [INFO] progress: Downloading org.eclipse.emf.transaction_root
13:32:08 [INFO] progress: Preparing to commit the provisioning operation.
13:32:08 [INFO] progress: Committing the provisioning operation.
13:32:08 [INFO] progress: Reading plug-ins
13:32:13 [INFO] Target platform is valid.
13:32:13 [INFO] Looking for tests...
13:32:13 [INFO] Existing projects in workspace:
13:32:13 [INFO]     <none>
13:32:13 [INFO] Importing projects to workspace:
13:32:13 [INFO] Refreshing projects:
13:32:13 [INFO]     C:\jenkins\build\workspace\elexis-uitest-windows\KernFunktionen\target\projects\KernFunktionen... OK
13:32:13 [INFO] Refreshing projects:
13:32:14 [INFO]     KernFunktionen... OK
13:32:14 [INFO] Searching for tests in projects:
13:32:14 [INFO]     KernFunktionen... 
13:32:19 [INFO] Complete OK
13:32:19 [INFO] Testcase Artifacts:30
13:32:19 [INFO] AUT-0:Launching
13:32:20 [INFO] AUT-0:Product: ch.elexis.core.application.product
13:32:20 [INFO] AUT-0:Application: ch.elexis.core.application.ElexisApp
13:32:20 [INFO] AUT-0:Architecture: x86_64
13:32:20 [INFO] 64bit arch is selected because AUT uses launcher library
13:32:20 [INFO] 	"plugins/org.eclipse.equinox.launcher.win32.win32.x86_64_1.1.1100.v20190907-0426" specified in config file: Elexis3.ini
13:32:20 [INFO] C:\jenkins\build\workspace\elexis-uitest-windows\KernFunktionen\target\aut-ws-0: AUT arguments: -nl de_CH -nosplash -noregtool --use-config=rpctt -os ${target.os} -arch ${target.arch} -consoleLog
13:32:20 [INFO] C:\jenkins\build\workspace\elexis-uitest-windows\KernFunktionen\target\aut-ws-0: AUT VM arguments: -Xms256m -Xmx1024m -Duser.language=de -Duser.region=CH -Dfile.encoding=utf-8 -Dorg.eclipse.gemini.refreshBundles=false -Djava.library.path=/usr/lib/jni -DGTK_IM_MODULE=ibus -Dlanguage=de -Duser.language=de -Dch.elexis.dbFlavor=h2 -Dch.elexis.dbSpec=jdbc:h2:C:\Users\nikla/elexis/h2_elexis_rcptt_de/db -Dch.elexis.dbUser=sa -Dch.elexis.dbPw= -Dch.elexis.firstMandantName=Mustermann -Dch.elexis.firstMandantPassword=elexisTest -Dch.elexis.firstMandantEmail=mmustermann@elexis.info -Dch.elexis.username=Mustermann -Dch.elexis.password=elexisTest -DvmArg10 -XX:MaxPermSize=128m
13:32:20 [INFO] Trying to use VM from application's ini file: plugins/ch.elexis.jre.win32.x86_64_1.8.252/jre/bin
13:32:20 [INFO] Unknown file system layout of Java VM from ini file
13:34:47 [INFO] AUT-0: Launch failed. Reason: Process was terminated while waiting for AUT startup data
13:34:47 [INFO] AUT-0: For more information check AUT output at 'C:\jenkins\build\workspace\elexis-uitest-windows\KernFunktionen\target\results\aut-console-0_console.log'
13:34:47 [INFO] Failed to launch AUT:AUT-0: Launch failed. Reason: Process was terminated while waiting for AUT startup data
13:34:47 [INFO] AUT-0:Launching
13:34:47 [INFO] AUT-0:Product: ch.elexis.core.application.product
13:34:47 [INFO] AUT-0:Application: ch.elexis.core.application.ElexisApp
13:34:47 [INFO] AUT-0:Architecture: x86_64
13:34:47 [INFO] 64bit arch is selected because AUT uses launcher library
13:34:47 [INFO] 	"plugins/org.eclipse.equinox.launcher.win32.win32.x86_64_1.1.1100.v20190907-0426" specified in config file: Elexis3.ini
13:34:47 [INFO] C:\jenkins\build\workspace\elexis-uitest-windows\KernFunktionen\target\aut-ws-0: AUT arguments: -nl de_CH -nosplash -noregtool --use-config=rpctt -os ${target.os} -arch ${target.arch} -consoleLog
13:34:47 [INFO] C:\jenkins\build\workspace\elexis-uitest-windows\KernFunktionen\target\aut-ws-0: AUT VM arguments: -Xms256m -Xmx1024m -Duser.language=de -Duser.region=CH -Dfile.encoding=utf-8 -Dorg.eclipse.gemini.refreshBundles=false -Djava.library.path=/usr/lib/jni -DGTK_IM_MODULE=ibus -Dlanguage=de -Duser.language=de -Dch.elexis.dbFlavor=h2 -Dch.elexis.dbSpec=jdbc:h2:C:\Users\nikla/elexis/h2_elexis_rcptt_de/db -Dch.elexis.dbUser=sa -Dch.elexis.dbPw= -Dch.elexis.firstMandantName=Mustermann -Dch.elexis.firstMandantPassword=elexisTest -Dch.elexis.firstMandantEmail=mmustermann@elexis.info -Dch.elexis.username=Mustermann -Dch.elexis.password=elexisTest -DvmArg10 -XX:MaxPermSize=128m
13:34:47 [INFO] Trying to use VM from application's ini file: plugins/ch.elexis.jre.win32.x86_64_1.8.252/jre/bin
13:34:47 [INFO] Unknown file system layout of Java VM from ini file
13:36:54 [INFO] Pass 1 (30) processed. 0 failed. spent: 0:28, 6:46 mins remaining. LOwriterMustBeInstalled. time: 24718ms 
13:37:09 [INFO] Pass 2 (30) processed. 0 failed. spent: 0:46, 5:10 mins remaining. OOWriterMustBeInstalled. time: 15267ms 
13:37:46 [INFO] Pass 3 (30) processed. 0 failed. spent: 1:23, 7:11 mins remaining. AboutElexis. time: 34631ms 
13:38:04 [INFO] Pass 4 (30) processed. 0 failed. spent: 1:38, 6:48 mins remaining. NoPreferenceWithPercent. time: 13801ms 
13:38:15 [INFO] Pass 5 (30) processed. 0 failed. spent: 1:51, 7:42 mins remaining. NoViewWithPercent. time: 11046ms 
13:38:37 [INFO] Pass 6 (30) processed. 0 failed. spent: 2:11, 6:16 mins remaining. CreateFemalePatient. time: 17775ms 
13:40:10 [INFO] Pass 7 (30) processed. 0 failed. spent: 3:46, 10:49 mins remaining. ImportAnalysenListe. time: 91156ms 
13:41:00 [INFO] Pass 8 (30) processed. 0 failed. spent: 4:34, 9:35 mins remaining. ImportBlocks. time: 45126ms 
13:41:44 [INFO] Pass 9 (30) processed. 0 failed. spent: 5:19, 9:40 mins remaining. ImportComplementary. time: 41907ms 
13:42:30 [INFO] Pass 10 (30) processed. 0 failed. spent: 6:07, 9:41 mins remaining. ImportKK_Patients. time: 43587ms 
13:45:24 [INFO] Pass 11 (30) processed. 0 failed. spent: 9:00, 14:15 mins remaining. ImportTarmed. time: 167252ms 
13:46:30 [INFO] Pass 12 (30) processed. 0 failed. spent: 10:05, 12:14 mins remaining. ImportArtikelstamm. time: 62727ms 
13:47:12 [INFO] Pass 13 (30) processed. 0 failed. spent: 10:48, 11:31 mins remaining. ImportMigel. time: 38887ms 
13:49:07 [INFO] Pass 14 (30) processed. 0 failed. spent: 12:44, 11:56 mins remaining. BasicMandanten. time: 111563ms 
13:49:55 [INFO] Pass 15 (30) processed. 0 failed. spent: 13:29, 11:06 mins remaining. BasicAbrechnungssytems. time: 42994ms 
13:50:35 [INFO] Pass 16 (30) processed. 0 failed. spent: 14:10, 10:13 mins remaining. CreateSQLdump. time: 39267ms 
13:50:45 [INFO] Pass 17 (30) processed. 0 failed. spent: 14:21, 9:03 mins remaining. RestartElexis. time: 8928ms 
13:50:50 [INFO] Fail 18 (30) processed. 1 failed. spent: 14:26, 9:06 mins remaining. CheckRestart. time: 4355ms  Cause: Failed to apply context Close modal dialogs
13:53:05 [INFO] Fail 19 (30) processed. 2 failed. spent: 16:41, 7:56 mins remaining. VerrechnenBeiGeschlossenemFall. time: 35674ms  Cause: Failed to set selection: [[.*]].
13:53:27 [INFO] Fail 20 (30) processed. 3 failed. spent: 17:01, 6:57 mins remaining. KonsDirektVerrechnen. time: 18011ms  Cause: Failed to set selection: [[.*]].
13:53:45 [INFO] Fail 21 (30) processed. 4 failed. spent: 17:20, 6:01 mins remaining. TarmedFallVerrechnen. time: 17098ms  Cause: Failed to set selection: [[.*]].
13:54:18 [INFO] Fail 22 (30) processed. 5 failed. spent: 17:53, 5:12 mins remaining. SetupTextPluginTests. time: 30918ms  Cause: Failed to set selection: [[OpenOffice.*]].
13:57:05 [INFO] Fail 23 (30) processed. 6 failed. spent: 20:39, 4:57 mins remaining. CheckTarmedFallVerrechnen. time: 155393ms  Cause: Failed to set selection: [[.*]].
13:57:23 [INFO] Fail 24 (30) processed. 7 failed. spent: 20:59, 5:02 mins remaining. BasicKonsTests. time: 17583ms  Cause: Failed to set selection: [[.*]].
13:58:40 [INFO] Pass 25 (30) processed. 7 failed. spent: 22:17, 3:18 mins remaining. Kassenbuch. time: 74309ms 
13:58:58 [INFO] Fail 26 (30) processed. 8 failed. spent: 22:32, 2:24 mins remaining. hilotec_odf_aut. time: 14192ms  Cause: Scriptlet SelectKontakt not found
13:59:16 [INFO] Fail 27 (30) processed. 9 failed. spent: 22:53, 1:34 mins remaining. medelexis_oo. time: 18508ms  Cause: Failed to set selection: [[OpenOffice.*]].
13:59:36 [INFO] Fail 28 (30) processed. 10 failed. spent: 23:11, 0:46 mins remaining. TimeTool. time: 16011ms  Cause: Failed to set selection: [[.*]].
14:04:32 [INFO] Fail 29 (30) processed. 11 failed. spent: 28:08, 0:00 mins remaining. VisitMostPreferences. time: 294637ms  Cause: Button apply and close must be enabled for 1,Omnivore
14:30:15 Process 1608899418598 is killed.
14:30:15 [INFO] ------------------------------------------------------------------------
14:30:15 [INFO] Reactor Summary:
14:30:15 [INFO] 
14:30:15 [INFO] elexis-master 3.9 .................................. SUCCESS [04:46 min]
14:30:15 [INFO] setup 0.1 .......................................... SUCCESS [ 15.919 s]
14:30:15 [INFO] KernFunktionen 0.1 ................................. FAILURE [  01:01 h]
14:30:15 [INFO] h2 0.1 ............................................. SKIPPED
14:30:15 [INFO] ------------------------------------------------------------------------
14:30:15 [INFO] BUILD FAILURE
14:30:15 [INFO] ------------------------------------------------------------------------
14:30:15 [INFO] Total time:  01:07 h
14:30:15 [INFO] Finished at: 2020-12-25T14:30:18+01:00
14:30:15 [INFO] ------------------------------------------------------------------------
14:30:15 [ERROR] Failed to execute goal org.eclipse.rcptt:rcptt-maven-plugin:2.5.1:execute (default-execute) on project KernFunktionen: Failed to launch RCPTT runner: Error while executing external command, process killed. Process timeout out after 3600 seconds -> [Help 1]
14:30:15 [ERROR] 
14:30:15 [ERROR] To see the full stack trace of the errors, re-run Maven with the -e switch.
14:30:15 [ERROR] Re-run Maven using the -X switch to enable full debug logging.
14:30:15 [ERROR] 
14:30:15 [ERROR] For more information about the errors and possible solutions, please read the following articles:
14:30:15 [ERROR] [Help 1] http://cwiki.apache.org/confluence/display/MAVEN/MojoExecutionException
14:30:15 [ERROR] 
14:30:15 [ERROR] After correcting the problems, you can resume the build with the command
14:30:15 [ERROR]   mvn <goals> -rf :KernFunktionen
14:30:22 [INFO] Process terminated. Send shutdown request to RCPTT runner.
14:30:22 [INFO] Process terminated. Shut down AUTs
14:30:24 Build step 'Maven Goals aufrufen' marked build as failure
14:30:27 Archiviere Artefakte
14:30:51 Started calculate disk usage of build
14:30:51 Finished Calculation of disk usage of build in 0 seconds
14:30:51 Started calculate disk usage of workspace
14:30:59 Finished Calculation of disk usage of workspace in  8 second
14:30:59 Finished: FAILURE