FailedConsole Output

22:39:33 Build wurde zeitgesteuert ausgelöst.
22:39:33 Running as SYSTEM
22:39:33 Baue auf dem Agenten „Elexis-WIndows-10“ (windows) in Arbeitsbereich C:\Jenkins\build\workspace\elexis-uitest-windows
22:39:33 [WS-CLEANUP] Deleting project workspace...
22:39:33 [WS-CLEANUP] Deferred wipeout is used...
22:39:34 [WS-CLEANUP] Done
22:39:34 The recommended git tool is: NONE
22:39:34 No credentials specified
22:39:34 Cloning the remote Git repository
22:39:34 Cloning repository http://github.com/elexis/elexis-uitest.git
22:39:34  > git init C:\Jenkins\build\workspace\elexis-uitest-windows # timeout=10
22:39:34 Fetching upstream changes from http://github.com/elexis/elexis-uitest.git
22:39:34  > git --version # timeout=10
22:39:34  > git --version # 'git version 2.19.2.windows.1'
22:39:34  > git fetch --tags --progress -- http://github.com/elexis/elexis-uitest.git +refs/heads/*:refs/remotes/origin/* # timeout=10
22:39:38  > git config remote.origin.url http://github.com/elexis/elexis-uitest.git # timeout=10
22:39:38  > git config --add remote.origin.fetch +refs/heads/*:refs/remotes/origin/* # timeout=10
22:39:38 Avoid second fetch
22:39:38  > git rev-parse "refs/remotes/origin/master^{commit}" # timeout=10
22:39:39 Checking out Revision 839cb6bf3a8f1dab18298c169fa771ced1732a3a (refs/remotes/origin/master)
22:39:39  > git config core.sparsecheckout # timeout=10
22:39:39  > git checkout -f 839cb6bf3a8f1dab18298c169fa771ced1732a3a # timeout=10
22:39:40 Commit message: "Save H2-SQL database only under Linux"
22:39:40  > git rev-list --no-walk 839cb6bf3a8f1dab18298c169fa771ced1732a3a # timeout=10
22:39:41 [elexis-uitest-windows] $ cmd.exe /C "C:\Jenkins\build\tools\hudson.tasks.Maven_MavenInstallation\3.6.0\bin\mvn.cmd -V clean verify -f h2/pom.xml --settings h2/settings.xml -Dsuite2run=SmokeTestSuite && exit %%ERRORLEVEL%%"
22:39:47 Apache Maven 3.6.0 (97c98ec64a1fdfee7767ce5ffb20918da4f719f3; 2018-10-24T20:41:47+02:00)
22:39:47 Maven home: C:\jenkins\build\tools\hudson.tasks.Maven_MavenInstallation\3.6.0\bin\..
22:39:47 Java version: 1.8.0_275, vendor: Amazon.com Inc., runtime: C:\Program Files\Amazon Corretto\jdk1.8.0_275\jre
22:39:47 Default locale: de_CH, platform encoding: Cp1252
22:39:47 OS name: "windows 10", version: "10.0", arch: "amd64", family: "windows"
22:39:50 [INFO] Scanning for projects...
22:39:56 [WARNING] No explicit target runtime environment configuration. Build is platform dependent.
22:40:09 [INFO] Computing target platform for MavenProject: ch.elexis.rcptt:elexis-master:3.9 @ C:\jenkins\build\workspace\elexis-uitest-windows\elexis-master\pom.xml
22:40:11 [INFO] Fetching p2.index from https://download.elexis.info/elexis/master/p2/elexis-3-core/ (172B)
22:40:11 [INFO] Adding repository https://download.elexis.info/elexis/master/p2/elexis-3-core
22:40:12 [INFO] Fetching p2.index from https://download.elexis.info/elexis/master/p2/elexis-3-base/ (172B)
22:40:13 [INFO] Adding repository https://download.elexis.info/elexis/master/p2/elexis-3-base
22:40:13 [INFO] Adding repository https://download.elexis.info/elexis/master/p2/target
22:40:14 [INFO] Resolving dependencies of MavenProject: ch.elexis.rcptt:elexis-master:3.9 @ C:\jenkins\build\workspace\elexis-uitest-windows\elexis-master\pom.xml
22:40:16 [INFO] Resolving class path of MavenProject: ch.elexis.rcptt:elexis-master:3.9 @ C:\jenkins\build\workspace\elexis-uitest-windows\elexis-master\pom.xml
22:40:24 [INFO] ------------------------------------------------------------------------
22:40:24 [INFO] Reactor Build Order:
22:40:24 [INFO] 
22:40:24 [INFO] elexis-master                                       [eclipse-repository]
22:40:24 [INFO] setup                                                              [pom]
22:40:24 [INFO] KernFunktionen                                               [rcpttTest]
22:40:24 [INFO] h2                                                                 [pom]
22:40:24 [INFO] 
22:40:24 [INFO] -------------------< ch.elexis.rcptt:elexis-master >--------------------
22:40:24 [INFO] Building elexis-master 3.9                                         [1/4]
22:40:24 [INFO] -------------------------[ eclipse-repository ]-------------------------
22:40:24 [INFO] 
22:40:24 [INFO] --- maven-clean-plugin:2.5:clean (default-clean) @ elexis-master ---
22:40:25 [INFO] 
22:40:25 [INFO] --- tycho-packaging-plugin:1.7.0:build-qualifier-aggregator (default-build-qualifier-aggregator) @ elexis-master ---
22:40:25 [INFO] The project's OSGi version is 3.9.0
22:40:25 [INFO] 
22:40:25 [INFO] --- maven-clean-plugin:2.5:clean (default-clean-1) @ elexis-master ---
22:40:25 [INFO] 
22:40:25 [INFO] --- maven-resources-plugin:2.4.3:resources (default-resources) @ elexis-master ---
22:40:27 [INFO] Using 'UTF-8' encoding to copy filtered resources.
22:40:27 [INFO] skip non existing resourceDirectory C:\jenkins\build\workspace\elexis-uitest-windows\elexis-master\src\main\resources
22:40:27 [INFO] 
22:40:27 [INFO] --- target-platform-configuration:1.7.0:target-platform (default-target-platform) @ elexis-master ---
22:40:28 [INFO] 
22:40:28 [INFO] --- tycho-p2-publisher-plugin:1.7.0:publish-osgi-ee (default-publish-osgi-ee) @ elexis-master ---
22:40:28 [INFO] Published profile IUs: [a.jre.javase 11.0.0, config.a.jre.javase 11.0.0]
22:40:28 [INFO] Published profile IUs: [a.jre.javase 14.0.0, config.a.jre.javase 14.0.0]
22:40:28 [INFO] 
22:40:28 [INFO] --- tycho-p2-publisher-plugin:1.7.0:publish-products (default-publish-products) @ elexis-master ---
22:40:30 [INFO] 
22:40:30 [INFO] --- tycho-p2-publisher-plugin:1.7.0:publish-categories (default-publish-categories) @ elexis-master ---
22:40:30 [INFO] 
22:40:30 [INFO] --- tycho-p2-publisher-plugin:1.7.0:attach-artifacts (default-attach-artifacts) @ elexis-master ---
22:40:30 [INFO] 
22:40:30 [INFO] --- tycho-p2-repository-plugin:1.7.0:assemble-repository (default-assemble-repository) @ elexis-master ---
22:42:11 [INFO] 
22:42:11 [INFO] --- tycho-p2-repository-plugin:1.7.0:archive-repository (default-archive-repository) @ elexis-master ---
22:42:12 [INFO] Building zip: C:\jenkins\build\workspace\elexis-uitest-windows\elexis-master\target\elexis-master-3.9.zip
22:42:34 [INFO] 
22:42:34 [INFO] --- tycho-p2-director-plugin:1.7.0:materialize-products (materialize-products) @ elexis-master ---
22:42:39 [INFO] Installing product ElexisAllOpenSourceApp for environment win32/win32/x86_64 to C:\jenkins\build\workspace\elexis-uitest-windows\elexis-master\target\products\ElexisAllOpenSourceApp\win32\win32\x86_64
22:42:41 Installing ElexisAllOpenSourceApp 3.9.0.
22:42:41 Installing at.gruber.elexis.mythic22.feature.feature.group 3.0.100.20201021-1138.
22:42:41 Installing at.medevit.elexis.agenda.feature.feature.group 1.0.100.20201126-1518.
22:42:41 Installing at.medevit.elexis.bluemedication.feature.feature.group 1.0.0.20201112-0828.
22:42:41 Installing at.medevit.elexis.cobasmira.feature.feature.group 3.0.100.20181207-1630.
22:42:41 Installing at.medevit.elexis.decision.feature.feature.group 3.0.100.20201112-0828.
22:42:41 Installing at.medevit.elexis.ehc.feature.feature.group 3.3.100.20201118-1351.
22:42:41 Installing at.medevit.elexis.emediplan.feature.feature.group 1.0.100.20201021-1138.
22:42:41 Installing at.medevit.elexis.gdt.defaultfilecp.feature.feature.group 3.1.100.20200901-1213.
22:42:41 Installing at.medevit.elexis.gdt.feature.feature.group 3.1.100.20201021-1502.
22:42:41 Installing at.medevit.elexis.impfplan.feature.feature.group 3.8.0.20201125-1133.
22:42:42 Installing at.medevit.elexis.inbox.feature.feature.group 3.0.100.20201012-1158.
22:42:42 Installing at.medevit.elexis.loinc.feature.feature.group 3.0.100.20200623-0838.
22:42:42 Installing at.medevit.elexis.medietikette.feature.feature.group 3.0.100.20200129-1200.
22:42:42 Installing ch.berchtold.privatrechnung.feature.feature.group 3.0.100.20200904-0740.
22:42:42 Installing ch.docbox.elexis.feature.feature.group 3.0.100.20201118-1351.
22:42:42 Installing ch.elexis.agenda.feature.feature.group 3.2.100.20201126-1518.
22:42:42 Installing ch.elexis.archie.patientstatistik.feature.feature.group 3.0.100.20201019-1344.
22:42:42 Installing ch.elexis.archie.wzw.feature.feature.group 3.0.100.20200820-1354.
22:42:42 Installing ch.elexis.barcode.scanner.feature.feature.group 3.2.100.20201021-1138.
22:42:42 Installing ch.elexis.base.befunde.feature.feature.group 3.0.100.20201218-1528.
22:42:42 Installing ch.elexis.base.ch.feature.feature.group 3.2.100.20201217-2215.
22:42:42 Installing ch.elexis.base.konsextension.bildanzeige.feature.feature.group 3.0.100.20181130-1349.
22:42:42 Installing ch.elexis.base.konsextension.privatnotizen.feature.feature.group 3.0.100.20181130-1343.
22:42:42 Installing ch.elexis.base.messages.feature.feature.group 3.0.100.20201021-1138.
22:42:42 Installing ch.elexis.base.messages.feature.feature.group 3.0.100.20201021-1138.
22:42:42 Installing ch.elexis.base.textplugin.feature.feature.group 3.0.100.20180614-0933.
22:42:42 Installing ch.elexis.base.textplugin.feature.feature.group 3.0.100.20180614-0933.
22:42:42 Installing ch.elexis.buchhaltung.basis.feature.feature.group 3.0.100.20190409-1417.
22:42:42 Installing ch.elexis.connect.afinion.feature.feature.group 3.0.100.20190409-1417.
22:42:42 Installing ch.elexis.connect.mythic.feature.feature.group 3.0.100.20190409-1417.
22:42:42 Installing ch.elexis.connect.reflotron.v2.feature.feature.group 3.0.100.20190409-1417.
22:42:42 Installing ch.elexis.connect.sysmex.feature.feature.group 3.0.100.20200417-1322.
22:42:42 Installing ch.elexis.connector.medicosearch.feature.feature.group 3.0.100.20200901-1213.
22:42:42 Installing ch.elexis.externe_dokumente.feature.feature.group 3.0.100.20200901-1913.
22:42:42 Installing ch.elexis.fop_wrapper.feature.feature.group 3.0.100.20200108-1208.
22:42:42 Installing ch.elexis.global_inbox.feature.feature.group 3.8.0.20201112-0902.
22:42:42 Installing ch.elexis.hl7.message.feature.feature.group 1.0.0.20200831-1449.
22:42:42 Installing ch.elexis.icpc.feature.feature.group 3.2.100.20200501-1250.
22:42:42 Installing ch.elexis.icpc.fire.feature.feature.group 3.2.100.20200901-1213.
22:42:42 Installing ch.elexis.impfplan.feature.feature.group 3.0.100.20191209-0913.
22:42:42 Installing ch.elexis.importer.aeskulap.feature.feature.group 1.0.0.20191209-0913.
22:42:42 Installing ch.elexis.kassenbuch.feature.feature.group 3.2.0.20201203-1605.
22:42:42 Installing ch.elexis.laborimport.analytica.feature.feature.group 3.1.100.20200831-1449.
22:42:42 Installing ch.elexis.laborimport.bioanalytica.feature.feature.group 3.0.100.20190411-1739.
22:42:42 Installing ch.elexis.laborimport.eurolyser.feature.feature.group 3.0.100.20201002-0856.
22:42:42 Installing ch.elexis.laborimport.hl7.allg.feature.feature.group 3.0.100.20200901-1213.
22:42:42 Installing ch.elexis.laborimport.medics.v2.feature.feature.group 3.0.100.20200831-1449.
22:42:42 Installing ch.elexis.laborimport.synlab.feature.feature.group 3.0.100.20190416-1030.
22:42:42 Installing ch.elexis.laborimport.teamw.feature.feature.group 3.1.100.20200831-1449.
22:42:42 Installing ch.elexis.laborimport.viollier.v2.feature.feature.group 3.0.100.20201002-0856.
22:42:42 Installing ch.elexis.laborimport_labtop.feature.feature.group 3.0.100.20180614-0933.
22:42:42 Installing ch.elexis.laborimport_lg1.feature.feature.group 3.0.100.20180614-0933.
22:42:42 Installing ch.elexis.laborimport_rischbern.feature.feature.group 3.0.100.20180614-0933.
22:42:42 Installing ch.elexis.laborimport_rothen.feature.feature.group 3.0.100.20180614-0933.
22:42:42 Installing ch.elexis.laborimport_viollier.feature.feature.group 3.0.100.20180309-1216.
22:42:42 Installing ch.elexis.labororder.lg1.feature.feature.group 1.0.0.20200421-1150.
22:42:42 Installing ch.elexis.molemax.feature.feature.group 3.0.100.20190128-1451.
22:42:42 Installing ch.elexis.notes.feature.feature.group 3.0.100.20190703-2009.
22:42:42 Installing ch.elexis.omnivore.feature.feature.group 3.2.100.20201223-1433.
22:42:42 Installing ch.elexis.privatrechnung.feature.feature.group 3.0.100.20200904-0740.
22:42:42 Installing ch.elexis.base.solr.feature.feature.group 1.0.0.20201222-1550.
22:42:42 Installing ch.elexis.stickynotes.feature.feature.group 3.0.100.20200924-1221.
22:42:42 Installing ch.elexis.support.dbshaker.feature.feature.group 3.0.100.20180309-1216.
22:42:42 Installing ch.gpb.elexis.cst.feature.feature.group 1.0.100.20200924-1221.
22:42:42 Installing ch.itmed.fop.printing.feature.feature.group 1.0.0.20201207-1510.
22:42:42 Installing ch.itmed.lmz.risch.laborder.feature.feature.group 3.7.0.20200901-1213.
22:42:42 Installing ch.medelexis.text.templator.feature.feature.group 3.0.100.20191115-1121.
22:42:42 Installing ch.medshare.connect.abacusjunior.feature.feature.group 3.0.100.20190411-1739.
22:42:42 Installing ch.medshare.elexis_directories.feature.feature.group 3.0.100.20180614-1456.
22:42:42 Installing ch.medshare.mediport.feature.feature.group 3.0.100.20201211-0824.
22:42:42 Installing ch.novcom.elexis.mednet.plugin.feature.feature.group 3.1.100.20201021-1138.
22:42:42 Installing ch.pharmed.phmprescriber.feature.feature.group 3.0.100.20200901-1213.
22:42:42 Installing ch.unibe.iam.scg.archie.feature.feature.group 3.0.100.20200831-1449.
22:42:42 Installing ch.weirich.templator.pages.feature.feature.group 3.0.100.20180309-1216.
22:42:42 Installing com.hilotec.elexis.kgview.feature.feature.group 3.0.100.20201002-0856.
22:42:42 Installing com.hilotec.elexis.messwerte.v2.feature.feature.group 3.0.100.20200901-1213.
22:42:42 Installing com.hilotec.elexis.opendocument.feature.feature.group 3.7.0.20190412-2013.
22:42:42 Installing at.medevit.medelexis.text.msword.feature.feature.group 3.8.0.20200611-1324.
22:42:42 Installing ch.medelexis.openoffice.feature.feature.group 3.8.0.20200611-1247.
22:42:42 Installing com.hilotec.elexis.opendocument2omnivore.feature.feature.group 3.0.100.20190430-1127.
22:42:42 Installing com.hilotec.elexis.pluginstatistiken.feature.feature.group 3.0.100.20201203-1126.
22:42:42 Installing com.hilotec.elexis.stickerprefix.feature.feature.group 3.0.100.20181207-1630.
22:42:42 Installing com.hilotec.elexis.toolbar.feature.feature.group 3.8.0.20201109-1555.
22:42:42 Installing net.medshare.connector.aerztekasse.feature.feature.group 3.0.100.20201002-0856.
22:42:42 Installing net.medshare.connector.viollier.feature.feature.group 3.0.100.20201010-1213.
22:42:42 Installing org.iatrix.bestellung.rose.feature.feature.group 3.0.100.20200904-0740.
22:42:42 Installing org.iatrix.messwerte.feature.feature.group 3.0.100.20201118-1351.
22:42:42 Installing at.medbits.elexis.labbit.feature.feature.group 1.0.0.20200226-1024.
22:42:42 Installing org.eclipse.rcp.feature.group 4.15.0.v20200305-0155.
22:42:42 Installing org.eclipse.emf.common.feature.group 2.18.0.v20191225-1014.
22:42:42 Installing org.eclipse.emf.ecore.feature.group 2.21.0.v20200127-1342.
22:42:42 Installing org.eclipse.e4.rcp.feature.group 4.15.0.v20200304-0601.
22:42:42 Installing ch.elexis.core.application.feature.feature.group 3.9.0.20201207-1452.
22:42:42 Installing ch.elexis.core.common.feature.feature.group 3.9.0.20201218-1528.
22:42:42 Installing ch.elexis.core.logging.feature.feature.group 3.9.0.20200226-0838.
22:42:42 Installing ch.elexis.core.persistence.feature.feature.group 1.0.0.20201214-1139.
22:42:42 Installing ch.elexis.core.spotlight.feature.feature.group 1.0.0.20201218-0946.
22:42:42 Installing ch.elexis.core.tasks.feature.feature.group 1.0.0.20201216-1221.
22:42:42 Installing ch.elexis.core.ui.chromium.feature.feature.group 1.0.0.20200517-2227.
22:42:42 Installing ch.elexis.core.ui.eenv.feature.feature.group 1.0.0.20200525-0930.
22:42:42 Installing ch.elexis.core.ui.feature.feature.group 3.9.0.20201218-1528.
22:42:42 Installing ch.elexis.core.ui.p2.feature.feature.group 3.9.0.20200226-0838.
22:42:42 Installing ch.elexis.jre.feature.feature.group 3.9.0.20200728-1155.
22:44:02 Operation completed in 83091 ms.
22:44:02 [INFO] 
22:44:02 [INFO] --- tycho-p2-director-plugin:1.7.0:archive-products (archive-products) @ elexis-master ---
22:44:05 [INFO] Building zip: C:\jenkins\build\workspace\elexis-uitest-windows\elexis-master\target\products\ElexisAllOpenSourceApp-win32.win32.x86_64.zip
22:44:40 [INFO] 
22:44:40 [INFO] -----------------------< ch.elexis.rcptt:setup >------------------------
22:44:40 [INFO] Building setup 0.1                                                 [2/4]
22:44:40 [INFO] --------------------------------[ pom ]---------------------------------
22:44:40 [INFO] 
22:44:40 [INFO] --- maven-clean-plugin:2.4.1:clean (default-clean) @ setup ---
22:44:40 [INFO] Deleting C:\Users\nikla\elexis (includes = [elexislock.*, localCfg*rcptt*xml, localCfg_default.xml], excludes = [])
22:44:40 [INFO] Deleting C:\Users\nikla\elexis\extern (includes = [], excludes = [])
22:44:40 [INFO] Deleting C:\Users\nikla\elexis\logs (includes = [], excludes = [])
22:44:40 [INFO] Deleting C:\Users\nikla\elexis\rcptt (includes = [], excludes = [])
22:44:43 [INFO] Deleting C:\Users\nikla\elexis\h2_elexis_rcptt_de (includes = [], excludes = [])
22:44:43 [INFO] 
22:44:43 [INFO] --- maven-antrun-plugin:1.8:run (copy-datafiles) @ setup ---
22:44:44 [INFO] Executing tasks
22:44:44 
22:44:44 main:
22:44:44      [copy] Copying 1 file to C:\Users\nikla\elexis\rcptt
22:44:44      [copy] Copying 1 file to C:\Users\nikla\elexis\rcptt
22:44:44      [copy] Copying 1 file to C:\Users\nikla\elexis\rcptt
22:44:44      [copy] Copying 1 file to C:\Users\nikla\elexis\rcptt
22:44:44      [copy] Copying 1 file to C:\Users\nikla\elexis\rcptt
22:44:44      [copy] Copying 1 file to C:\Users\nikla\elexis\rcptt
22:44:44      [copy] Copying 1 file to C:\Users\nikla\elexis\rcptt
22:44:44      [copy] Copying 1 file to C:\Users\nikla\elexis\rcptt
22:44:44      [copy] Copying 1 file to C:\Users\nikla\elexis\rcptt
22:44:44      [copy] Copying 1 file to C:\Users\nikla\elexis\extern
22:44:44 [INFO] Executed tasks
22:44:44 [INFO] 
22:44:44 [INFO] --- download-maven-plugin:1.4.1:wget (download-Universal-krankenkasse) @ setup ---
22:44:45 [INFO] Got from cache: C:\Users\nikla\.m2\repository\.cache\download-maven-plugin\Universal_krankenkasse.xls_c288e7dff2ce738af352a93b709ba8ee
22:44:46 [INFO] 
22:44:46 [INFO] --- download-maven-plugin:1.4.1:wget (download-Universal-patienten) @ setup ---
22:44:46 [INFO] Got from cache: C:\Users\nikla\.m2\repository\.cache\download-maven-plugin\Universal_patienten.xls_98f033b19915ff90aa0f1aa4ea0ce769
22:44:46 [INFO] 
22:44:46 [INFO] --- download-maven-plugin:1.4.1:wget (download-ODF-Hilotec-Vorlagen) @ setup ---
22:44:46 [INFO] Got from cache: C:\Users\nikla\.m2\repository\.cache\download-maven-plugin\master.zip_118f755fbfe4d51588edd8c52a340327
22:44:46 [INFO] 
22:44:46 [INFO] --- download-maven-plugin:1.4.1:wget (download-Medelexis-Vorlagen_OpenOffice_Fenster_rechts) @ setup ---
22:44:46 [INFO] Got from cache: C:\Users\nikla\.m2\repository\.cache\download-maven-plugin\Bundle_OpenOffice_Fenster_rechts.zip_e862727d62681b0c7532e81d0d73c7cf
22:44:47 [INFO] 
22:44:47 [INFO] --- download-maven-plugin:1.4.1:wget (download-Medelexis-Vorlagen_OpenOffice_Fenster_links) @ setup ---
22:44:47 [INFO] Got from cache: C:\Users\nikla\.m2\repository\.cache\download-maven-plugin\Bundle_OpenOffice_Fenster_links.zip_89703e11a7d02353a7da1c5fda877aeb
22:44:47 [INFO] 
22:44:47 [INFO] --- download-maven-plugin:1.4.1:wget (download-complementary_24022020) @ setup ---
22:44:47 [INFO] Got from cache: C:\Users\nikla\.m2\repository\.cache\download-maven-plugin\complementary_24022020.csv_c04b57200f57550d598a7c073774dc0d
22:44:47 [INFO] 
22:44:47 [INFO] --- download-maven-plugin:1.4.1:wget (download-MiGeL-01.04.20.xlsx) @ setup ---
22:44:47 [INFO] Got from cache: C:\Users\nikla\.m2\repository\.cache\download-maven-plugin\MiGeL-01.04.20.xlsx_f8ebf8b88d939313bb193cc6e0a3c0f7
22:44:47 [INFO] 
22:44:47 [INFO] --- download-maven-plugin:1.4.1:wget (download-MiGeL-01012019-de) @ setup ---
22:44:48 [INFO] Got from cache: C:\Users\nikla\.m2\repository\.cache\download-maven-plugin\MiGeL-01012019_de.csv_a9e19a9472b39869337bde74b6b23971
22:44:48 [INFO] 
22:44:48 [INFO] --- download-maven-plugin:1.4.1:wget (download-MiGeL-01012019-fr) @ setup ---
22:44:48 [INFO] Got from cache: C:\Users\nikla\.m2\repository\.cache\download-maven-plugin\MiGeL-01012019_fr.csv_676bff6041e4f53a01d0bea4d92d0ba4
22:44:48 [INFO] 
22:44:48 [INFO] --- download-maven-plugin:1.4.1:wget (download-Analyseliste_EAL) @ setup ---
22:44:48 [INFO] Got from cache: C:\Users\nikla\.m2\repository\.cache\download-maven-plugin\EAL_01.04.2020.xlsx_1d80cf14385245dd60ca40d768e65645
22:44:48 [INFO] 
22:44:48 [INFO] --- download-maven-plugin:1.4.1:wget (download-TARMED_01_09_00) @ setup ---
22:44:48 [INFO] Got from cache: C:\Users\nikla\.m2\repository\.cache\download-maven-plugin\TARMED__Datenbank_01.09.00_BR_KVG-27.12.2017.zip_bd87bcc5af197df64dc1425d03586196
22:44:48 [INFO] 
22:44:48 [INFO] --- download-maven-plugin:1.4.1:wget (download-h2-jar) @ setup ---
22:44:49 [INFO] Got from cache: C:\Users\nikla\.m2\repository\.cache\download-maven-plugin\h2-1.4.200.jar_b67743147e0f0825111743bcfde31c5c
22:44:49 [INFO] 
22:44:49 [INFO] --- download-maven-plugin:1.4.1:wget (download-blocks_landarztpraxis_sevelen) @ setup ---
22:44:49 [INFO] Got from cache: C:\Users\nikla\.m2\repository\.cache\download-maven-plugin\blocks_landarztpraxis_sevelen.xchange_90bd58b5cbb43a81d5ab8527c78aec2a
22:44:49 [INFO] 
22:44:49 [INFO] --- download-maven-plugin:1.4.1:wget (download-artikelstamm_01012019_v5) @ setup ---
22:44:54 [INFO] Got from cache: C:\Users\nikla\.m2\repository\.cache\download-maven-plugin\artikelstamm_01012019_v5.xml_0ea1a1b00b8b41bd13668144b84b5961
22:45:00 [INFO] 
22:45:00 [INFO] -------------------< ch.elexis.rcptt:KernFunktionen >-------------------
22:45:00 [INFO] Building KernFunktionen 0.1                                        [3/4]
22:45:00 [INFO] -----------------------------[ rcpttTest ]------------------------------
22:45:00 Downloading from rcptt-snapshots: https://repo.eclipse.org/content/repositories/rcptt-snapshots/org/apache/maven/plugins/maven-install-plugin/maven-metadata.xml
22:45:02 Downloading from rcptt-snapshots: https://repo.eclipse.org/content/repositories/rcptt-snapshots/org/apache/maven/plugins/maven-deploy-plugin/maven-metadata.xml
22:45:02 [INFO] 
22:45:02 [INFO] --- maven-clean-plugin:2.5:clean (default-clean) @ KernFunktionen ---
22:45:02 [INFO] 
22:45:02 [INFO] --- maven-antrun-plugin:1.8:run (drop-create-database C:\jenkins\build\workspace\elexis-uitest-windows\KernFunktionen/drop_create_db.bat) @ KernFunktionen ---
22:45:03 [INFO] Executing tasks
22:45:03 
22:45:03 main:
22:45:03      [exec] 
22:45:03      [exec] C:\jenkins\build\workspace\elexis-uitest-windows\KernFunktionen>echo No drop/create database needed for h2 
22:45:03      [exec] No drop/create database needed for h2
22:45:03 [INFO] Executed tasks
22:45:03 [INFO] 
22:45:03 [INFO] --- rcptt-maven-plugin:2.5.1:resources (default-resources) @ KernFunktionen ---
22:45:03 Downloading from rcptt-snapshots: https://repo.eclipse.org/content/repositories/rcptt-snapshots/org/eclipse/rcptt/runner/rcptt.runner/maven-metadata.xml
22:45:04 Progress (1): 436 B
                   
Downloaded from rcptt-snapshots: https://repo.eclipse.org/content/repositories/rcptt-snapshots/org/eclipse/rcptt/runner/rcptt.runner/maven-metadata.xml (436 B at 446 B/s)
22:45:04 [INFO] version is not specified for RCPTT runner, setting to 2.5.2-SNAPSHOT by default
22:45:04 Downloading from rcptt-snapshots: https://repo.eclipse.org/content/repositories/rcptt-snapshots/org/eclipse/rcptt/runner/rcptt.runner/2.5.2-SNAPSHOT/
22:45:05 Progress (1): 1.2 kB
Progress (1): 4.9 kB
[WARNING] Could not validate integrity of download from https://repo.eclipse.org/content/repositories/rcptt-snapshots/org/eclipse/rcptt/runner/rcptt.runner/2.5.2-SNAPSHOT/: Checksum validation failed, no checksums available
22:45:05                     
[WARNING] Checksum validation failed, no checksums available from rcptt-snapshots for https://repo.eclipse.org/content/repositories/rcptt-snapshots/org/eclipse/rcptt/runner/rcptt.runner/2.5.2-SNAPSHOT/
22:45:05 Downloaded from rcptt-snapshots: https://repo.eclipse.org/content/repositories/rcptt-snapshots/org/eclipse/rcptt/runner/rcptt.runner/2.5.2-SNAPSHOT/ (4.9 kB at 4.1 kB/s)
22:45:05 [INFO] Resolving artifact org.eclipse.rcptt.runner:rcptt.runner:zip:2.5.2-SNAPSHOT, this may take a while ...
22:45:05 Downloading from rcptt-snapshots: https://repo.eclipse.org/content/repositories/rcptt-snapshots/org/eclipse/rcptt/runner/rcptt.runner/2.5.2-SNAPSHOT/maven-metadata.xml
22:45:06 Progress (1): 792 B
                   
Downloaded from rcptt-snapshots: https://repo.eclipse.org/content/repositories/rcptt-snapshots/org/eclipse/rcptt/runner/rcptt.runner/2.5.2-SNAPSHOT/maven-metadata.xml (792 B at 818 B/s)
22:45:06 [INFO] Artifact org.eclipse.rcptt.runner:rcptt.runner:zip:2.5.2-SNAPSHOT is resolved to C:\Users\nikla\.m2\repository\org\eclipse\rcptt\runner\rcptt.runner\2.5.2-SNAPSHOT\rcptt.runner-2.5.2-SNAPSHOT.zip
22:45:06 [INFO] Extracting AUT to C:\jenkins\build\workspace\elexis-uitest-windows\KernFunktionen\target\aut
22:45:46 [INFO] Extracting RCPTT runner to C:\jenkins\build\workspace\elexis-uitest-windows\KernFunktionen\target\runner
22:46:14 [INFO] Copying project contents to target directory...
22:46:21 [INFO] 
22:46:21 [INFO] --- rcptt-maven-plugin:2.5.1:execute (default-execute) @ KernFunktionen ---
22:46:22 [INFO] Runner command line is cmd.exe /X /C ""C:\Program Files\Amazon Corretto\jdk1.8.0_275\jre\bin\java.exe" -Xms128m -Xmx256m -Dorg.eclipse.rcptt.runner.returnTestFailure=true -jar C:\jenkins\build\workspace\elexis-uitest-windows\KernFunktionen\target\runner\eclipse\plugins\org.eclipse.equinox.launcher_1.5.700.v20200207-2156.jar -application org.eclipse.rcptt.runner.headless -runnerPlatform swt -data C:\jenkins\build\workspace\elexis-uitest-windows\KernFunktionen\target\runner-workspace -aut C:\jenkins\build\workspace\elexis-uitest-windows\KernFunktionen\target\aut -autWsPrefix C:\jenkins\build\workspace\elexis-uitest-windows\KernFunktionen\target\aut-ws- -autConsolePrefix C:\jenkins\build\workspace\elexis-uitest-windows\KernFunktionen\target\results\aut-console- -autVMArgs -Djava.library.path=/usr/lib/jni;-DGTK_IM_MODULE=ibus;-Dlanguage=de;-Duser.language=de;-Dch.elexis.dbFlavor=h2;-Dch.elexis.dbSpec=jdbc:h2:C:\Users\nikla/elexis/h2_elexis_rcptt_de/db;-Dch.elexis.dbUser=sa;-Dch.elexis.dbPw=;-Dch.elexis.firstMandantName=Mustermann;-Dch.elexis.firstMandantPassword=elexisTest;-Dch.elexis.firstMandantEmail=mmustermann@elexis.info;-Dch.elexis.username=Mustermann;-Dch.elexis.password=elexisTest;-DvmArg10 -autArgs -nl;de_CH;-nosplash;-noregtool;--use-config=rpctt -q7report C:\jenkins\build\workspace\elexis-uitest-windows\KernFunktionen\target\results\KernFunktionen.report -htmlReport C:\jenkins\build\workspace\elexis-uitest-windows\KernFunktionen\target\results\KernFunktionen.html -junitReport C:\jenkins\build\workspace\elexis-uitest-windows\KernFunktionen\target\surefire-reports\TEST-KernFunktionen.xml -import C:\jenkins\build\workspace\elexis-uitest-windows\KernFunktionen\target\projects\KernFunktionen -testOptions contextRunnableTimeout=5403000;launchingKillAutOnConnectError=true;passedTestDetails=true;testExecTimeout=5410 -timeout 3600 -shutdownListenerPort 8870 -suites SmokeTestSuite"
22:46:22 [INFO] The execution timeout is set to 3600 seconds
22:46:55 [INFO] Started at Thu Dec 24 22:46:56 CET 2020
22:46:55 [INFO] RCPTT Runner version: 2.5.2
22:46:57 [INFO] com.xored.reporting.passed.test.details set to true
22:46:57 [INFO] launching.kill.aut.on.connect.error set to true
22:46:57 [INFO] context.runnable.timeout set to 5403000
22:46:57 [INFO] Initializing target platform...
22:46:57 [INFO] Begin task: Create AUT configuration
22:46:57 [INFO] progress: Resolving Target Contents...
22:46:57 [INFO] progress: Reading plug-ins
22:47:26 [INFO] progress: Fetching p2.index from platform:/plugin/org.eclipse.rcptt.updates.runtime.e4x/q7/
22:47:26 [INFO] progress: Adding repository platform:///plugin/org.eclipse.rcptt.updates.runtime.e4x/q7/
22:47:26 [INFO] progress: Fetching content.jar from platform:/plugin/org.eclipse.rcptt.updates.runtime.e4x/q7/
22:47:27 [INFO] progress: Fetching p2.index from platform:/plugin/org.eclipse.rcptt.updates.runtime.e4x/q7/
22:47:28 [INFO] progress: Fetching content.jar from platform:/plugin/org.eclipse.rcptt.updates.runtime.e4x/q7/
22:47:28 [INFO] progress: Fetching p2.index from platform:/plugin/org.eclipse.rcptt.updates.runtime.e4x/q7/
22:47:28 [INFO] progress: Fetching artifacts.jar from platform:/plugin/org.eclipse.rcptt.updates.runtime.e4x/q7/
22:47:29 [INFO] progress: The user operation is waiting for background work to complete.
22:47:36 [INFO] progress: Downloading org.antlr.runtime
22:47:36 [INFO] progress: The user operation is waiting for background work to complete.
22:47:56 [INFO] progress: Adding repository platform:///plugin/org.eclipse.rcptt.updates.aspectj.e44x/dependencies/
22:47:56 [INFO] progress: Fetching content.jar from platform:/plugin/org.eclipse.rcptt.updates.aspectj.e44x/dependencies/
22:47:56 [INFO] progress: Fetching artifacts.jar from platform:/plugin/org.eclipse.rcptt.updates.aspectj.e44x/dependencies/
22:47:56 [INFO] progress: Downloading org.aspectj.runtime
22:47:56 [INFO] progress: Downloading org.eclipse.equinox.weaving.hook
22:47:56 [INFO] progress: Downloading org.eclipse.equinox.weaving.aspectj
22:47:56 [INFO] progress: Downloading org.aspectj.weaver
22:47:56 [INFO] progress: The user operation is waiting for background work to complete.
22:47:57 [INFO] progress: Adding repository platform:///plugin/org.eclipse.rcptt.updates.kepler/dependencies/
22:47:57 [INFO] progress: Fetching content.jar from platform:/plugin/org.eclipse.rcptt.updates.kepler/dependencies/
22:47:57 [INFO] progress: Fetching artifacts.jar from platform:/plugin/org.eclipse.rcptt.updates.kepler/dependencies/
22:47:58 [INFO] progress: Downloading org.eclipse.emf.converter
22:47:58 [INFO] progress: The user operation is waiting for background work to complete.
22:47:58 [INFO] progress: Downloading org.eclipse.emf.mapping.ecore2ecore
22:47:58 [INFO] progress: Downloading org.eclipse.emf.ecore.change
22:47:58 [INFO] progress: The user operation is waiting for background work to complete.
22:47:58 [INFO] progress: Downloading org.eclipse.emf.transaction.ui
22:47:58 [INFO] progress: The user operation is waiting for background work to complete.
22:47:58 [INFO] progress: Downloading org.eclipse.emf.validation
22:47:58 [INFO] progress: The user operation is waiting for background work to complete.
22:47:58 [INFO] progress: Downloading org.eclipse.emf.codegen.ecore
22:47:58 [INFO] progress: The user operation is waiting for background work to complete.
22:47:58 [INFO] progress: Downloading org.eclipse.emf.mapping.ecore.editor
22:47:58 [INFO] progress: The user operation is waiting for background work to complete.
22:47:58 [INFO] progress: Downloading org.eclipse.emf.validation_root
22:47:58 [INFO] progress: The user operation is waiting for background work to complete.
22:47:58 [INFO] progress: Downloading org.eclipse.emf
22:47:58 [INFO] progress: The user operation is waiting for background work to complete.
22:47:58 [INFO] progress: Downloading org.eclipse.emf.ecore.change.edit
22:47:58 [INFO] progress: The user operation is waiting for background work to complete.
22:47:58 [INFO] progress: Downloading org.eclipse.emf.importer.ecore
22:47:58 [INFO] progress: The user operation is waiting for background work to complete.
22:47:58 [INFO] progress: Downloading org.eclipse.emf.codegen.ui
22:47:58 [INFO] progress: The user operation is waiting for background work to complete.
22:47:58 [INFO] progress: Downloading org.eclipse.emf.mapping.ecore2ecore.editor
22:47:58 [INFO] progress: The user operation is waiting for background work to complete.
22:47:58 [INFO] progress: Downloading org.eclipse.emf.ecore.xmi
22:47:58 [INFO] progress: The user operation is waiting for background work to complete.
22:47:59 [INFO] progress: Downloading org.eclipse.emf.mapping.ui
22:47:59 [INFO] progress: The user operation is waiting for background work to complete.
22:47:59 [INFO] progress: Downloading org.eclipse.emf.databinding.edit
22:47:59 [INFO] progress: The user operation is waiting for background work to complete.
22:47:59 [INFO] progress: Downloading org.eclipse.emf.mapping
22:47:59 [INFO] progress: The user operation is waiting for background work to complete.
22:47:59 [INFO] progress: Downloading org.eclipse.emf.ecore
22:47:59 [INFO] progress: The user operation is waiting for background work to complete.
22:47:59 [INFO] progress: Downloading org.eclipse.emf.codegen.ecore.ui
22:47:59 [INFO] progress: The user operation is waiting for background work to complete.
22:47:59 [INFO] progress: Downloading org.eclipse.emf.importer
22:47:59 [INFO] progress: The user operation is waiting for background work to complete.
22:47:59 [INFO] progress: Downloading org.eclipse.emf.mapping.ecore2xml.ui
22:47:59 [INFO] progress: The user operation is waiting for background work to complete.
22:47:59 [INFO] progress: Downloading org.eclipse.emf.databinding
22:47:59 [INFO] progress: The user operation is waiting for background work to complete.
22:47:59 [INFO] progress: Downloading org.eclipse.emf
22:47:59 [INFO] progress: The user operation is waiting for background work to complete.
22:47:59 [INFO] progress: Downloading org.eclipse.emf.ecore.edit
22:47:59 [INFO] progress: The user operation is waiting for background work to complete.
22:47:59 [INFO] progress: Downloading org.eclipse.emf.validation.ui
22:47:59 [INFO] progress: The user operation is waiting for background work to complete.
22:47:59 [INFO] progress: Downloading org.eclipse.emf.databinding
22:47:59 [INFO] progress: The user operation is waiting for background work to complete.
22:47:59 [INFO] progress: Downloading org.eclipse.emf.transaction
22:47:59 [INFO] progress: The user operation is waiting for background work to complete.
22:47:59 [INFO] progress: Downloading org.eclipse.emf.ecore.editor
22:47:59 [INFO] progress: The user operation is waiting for background work to complete.
22:47:59 [INFO] progress: Downloading org.eclipse.emf.codegen.ecore
22:47:59 [INFO] progress: The user operation is waiting for background work to complete.
22:48:00 [INFO] progress: Downloading org.eclipse.emf.common.ui
22:48:00 [INFO] progress: The user operation is waiting for background work to complete.
22:48:00 [INFO] progress: Downloading org.eclipse.emf.mapping.ecore2xml
22:48:00 [INFO] progress: The user operation is waiting for background work to complete.
22:48:00 [INFO] progress: Downloading org.eclipse.emf.mapping.ecore
22:48:00 [INFO] progress: The user operation is waiting for background work to complete.
22:48:00 [INFO] progress: Downloading org.eclipse.emf.ecore
22:48:00 [INFO] progress: The user operation is waiting for background work to complete.
22:48:00 [INFO] progress: Downloading org.eclipse.emf.mapping
22:48:00 [INFO] progress: The user operation is waiting for background work to complete.
22:48:00 [INFO] progress: Downloading org.eclipse.emf.edit.ui
22:48:00 [INFO] progress: The user operation is waiting for background work to complete.
22:48:00 [INFO] progress: Downloading org.eclipse.emf.exporter
22:48:00 [INFO] progress: The user operation is waiting for background work to complete.
22:48:00 [INFO] progress: Downloading org.eclipse.emf.mapping.ui
22:48:00 [INFO] progress: The user operation is waiting for background work to complete.
22:48:00 [INFO] progress: Downloading org.eclipse.emf.converter
22:48:00 [INFO] progress: The user operation is waiting for background work to complete.
22:48:00 [INFO] progress: Downloading org.eclipse.emf.transaction
22:48:00 [INFO] progress: The user operation is waiting for background work to complete.
22:48:00 [INFO] progress: Downloading org.eclipse.emf.transaction_root
22:48:00 [INFO] progress: The user operation is waiting for background work to complete.
22:48:00 [INFO] progress: Downloading org.eclipse.emf.databinding.edit
22:48:00 [INFO] progress: The user operation is waiting for background work to complete.
22:48:00 [INFO] progress: Downloading org.eclipse.emf.ecore.edit
22:48:00 [INFO] progress: The user operation is waiting for background work to complete.
22:48:00 [INFO] progress: Downloading org.eclipse.emf.validation
22:48:00 [INFO] progress: The user operation is waiting for background work to complete.
22:48:00 [INFO] progress: Downloading org.eclipse.emf.importer.rose
22:48:00 [INFO] progress: The user operation is waiting for background work to complete.
22:48:00 [INFO] progress: Downloading org.eclipse.emf.edit.ui
22:48:00 [INFO] progress: The user operation is waiting for background work to complete.
22:48:00 [INFO] progress: Downloading org.eclipse.emf.ant
22:48:00 [INFO] progress: The user operation is waiting for background work to complete.
22:48:00 [INFO] progress: Downloading org.eclipse.emf.importer.java
22:48:00 [INFO] progress: The user operation is waiting for background work to complete.
22:48:00 [INFO] progress: Downloading org.eclipse.emf.codegen.ecore.ui
22:48:00 [INFO] progress: The user operation is waiting for background work to complete.
22:48:00 [INFO] progress: Downloading org.eclipse.emf.edit
22:48:00 [INFO] progress: The user operation is waiting for background work to complete.
22:48:00 [INFO] progress: Downloading org.eclipse.emf.common.ui
22:48:00 [INFO] progress: The user operation is waiting for background work to complete.
22:48:00 [INFO] progress: Downloading org.eclipse.emf.codegen
22:48:00 [INFO] progress: The user operation is waiting for background work to complete.
22:48:00 [INFO] progress: Downloading org.eclipse.emf.common
22:48:00 [INFO] progress: The user operation is waiting for background work to complete.
22:48:00 [INFO] progress: Downloading org.eclipse.emf.ecore.editor
22:48:00 [INFO] progress: The user operation is waiting for background work to complete.
22:48:01 [INFO] progress: Downloading org.eclipse.emf.mapping.ecore
22:48:01 [INFO] progress: The user operation is waiting for background work to complete.
22:48:01 [INFO] progress: Downloading org.eclipse.emf.mapping.ecore.editor
22:48:01 [INFO] progress: The user operation is waiting for background work to complete.
22:48:01 [INFO] progress: Downloading org.eclipse.emf.validation.ui.ide
22:48:01 [INFO] progress: The user operation is waiting for background work to complete.
22:48:01 [INFO] progress: Downloading org.eclipse.emf.common
22:48:01 [INFO] progress: The user operation is waiting for background work to complete.
22:48:01 [INFO] progress: Downloading org.eclipse.emf.edit
22:48:01 [INFO] progress: The user operation is waiting for background work to complete.
22:48:01 [INFO] progress: Downloading org.eclipse.emf.codegen
22:48:01 [INFO] progress: The user operation is waiting for background work to complete.
22:48:01 [INFO] progress: Downloading org.eclipse.emf.codegen.ui
22:48:01 [INFO] progress: The user operation is waiting for background work to complete.
22:48:05 [INFO] progress: Adding repository platform:///plugin/org.eclipse.rcptt.module.nebula.updates/runtime/
22:48:05 [INFO] progress: Fetching content.jar from platform:/plugin/org.eclipse.rcptt.module.nebula.updates/runtime/
22:48:05 [INFO] progress: Fetching artifacts.jar from platform:/plugin/org.eclipse.rcptt.module.nebula.updates/runtime/
22:48:05 [INFO] progress: The user operation is waiting for background work to complete.
22:48:06 [INFO] progress: Adding repository platform:///plugin/org.eclipse.rcptt.module.testrail.updates/runtime/
22:48:06 [INFO] progress: Fetching content.jar from platform:/plugin/org.eclipse.rcptt.module.testrail.updates/runtime/
22:48:06 [INFO] progress: Fetching artifacts.jar from platform:/plugin/org.eclipse.rcptt.module.testrail.updates/runtime/
22:48:06 [INFO] progress: The user operation is waiting for background work to complete.
22:48:07 [INFO] progress: Adding repository platform:///plugin/org.eclipse.rcptt.updates.extra/dependencies/
22:48:07 [INFO] progress: Fetching content.jar from platform:/plugin/org.eclipse.rcptt.updates.extra/dependencies/
22:48:07 [INFO] progress: Fetching artifacts.jar from platform:/plugin/org.eclipse.rcptt.updates.extra/dependencies/
22:48:07 [INFO] progress: Downloading org.apache.poi.ooxml
22:48:07 [INFO] progress: Downloading org.apache.xmlbeans
22:48:07 [INFO] progress: Downloading org.apache.poi.ooxml.schemas
22:48:07 [INFO] progress: Downloading org.dom4j
22:48:07 [INFO] progress: The user operation is waiting for background work to complete.
22:48:08 [INFO] progress: Downloading org.apache.poi
22:48:08 [INFO] progress: The user operation is waiting for background work to complete.
22:48:10 [INFO] progress: Resolving Target Contents...
22:48:10 [INFO] progress: Reading plug-ins
22:48:10 [INFO] progress: Fetching p2.index from platform:/plugin/org.eclipse.rcptt.updates.runtime.e4x/q7/
22:48:11 [INFO] progress: Fetching content.jar from platform:/plugin/org.eclipse.rcptt.updates.runtime.e4x/q7/
22:48:11 [INFO] progress: Fetching content.jar from platform:/plugin/org.eclipse.rcptt.updates.aspectj.e44x/dependencies/
22:48:11 [INFO] progress: Fetching content.jar from platform:/plugin/org.eclipse.rcptt.updates.kepler/dependencies/
22:48:11 [INFO] progress: Fetching content.jar from platform:/plugin/org.eclipse.rcptt.module.nebula.updates/runtime/
22:48:11 [INFO] progress: Fetching content.jar from platform:/plugin/org.eclipse.rcptt.module.testrail.updates/runtime/
22:48:12 [INFO] progress: Fetching content.jar from platform:/plugin/org.eclipse.rcptt.updates.extra/dependencies/
22:48:12 [INFO] progress: Fetching p2.index from platform:/plugin/org.eclipse.rcptt.updates.runtime.e4x/q7/
22:48:12 [INFO] progress: Fetching artifacts.jar from platform:/plugin/org.eclipse.rcptt.updates.runtime.e4x/q7/
22:48:12 [INFO] progress: Fetching artifacts.jar from platform:/plugin/org.eclipse.rcptt.module.testrail.updates/runtime/
22:48:12 [INFO] progress: Fetching artifacts.jar from platform:/plugin/org.eclipse.rcptt.updates.kepler/dependencies/
22:48:13 [INFO] progress: Fetching artifacts.jar from platform:/plugin/org.eclipse.rcptt.module.nebula.updates/runtime/
22:48:13 [INFO] progress: Fetching artifacts.jar from platform:/plugin/org.eclipse.rcptt.updates.aspectj.e44x/dependencies/
22:48:13 [INFO] progress: Fetching artifacts.jar from platform:/plugin/org.eclipse.rcptt.updates.extra/dependencies/
22:48:13 [INFO] progress: Downloading org.eclipse.emf.validation_root
22:48:13 [INFO] progress: Downloading org.eclipse.emf.transaction_root
22:48:13 [INFO] progress: Installing org.eclipse.rcptt.ctx.script
22:48:13 [INFO] progress: Installing org.eclipse.rcptt.ctx.parameters.impl
22:48:13 [INFO] progress: Installing org.eclipse.emf.ecore.change
22:48:13 [INFO] progress: Installing org.eclipse.rcptt.ecl.server.feature.jar
22:48:13 [INFO] progress: Installing org.eclipse.rcptt.ctx.filesystem
22:48:13 [INFO] progress: Installing org.eclipse.rcptt.tesla.recording.draw2d
22:48:13 [INFO] progress: Installing org.eclipse.rcptt.ecl.doc
22:48:13 [INFO] progress: Installing org.eclipse.rcptt.ecl.parser
22:48:13 [INFO] progress: Installing org.eclipse.rcptt.tesla.recording.core.ecl
22:48:13 [INFO] progress: Installing org.eclipse.rcptt.tesla.runtime.feature.group
22:48:13 [INFO] progress: Installing org.eclipse.rcptt.tesla.gmf
22:48:13 [INFO] progress: Installing org.eclipse.emf.ecore.xmi
22:48:13 [INFO] progress: Installing org.eclipse.emf.mapping.feature.jar
22:48:13 [INFO] progress: Installing org.dom4j
22:48:13 [INFO] progress: Installing org.eclipse.rcptt.ctx.preferences.impl
22:48:13 [INFO] progress: Installing org.eclipse.rcptt.watson.aspects.jobs
22:48:13 [INFO] progress: Installing org.eclipse.rcptt.reporting
22:48:13 [INFO] progress: Installing org.eclipse.emf.importer
22:48:13 [INFO] progress: Installing org.eclipse.emf.mapping.ecore2xml.ui
22:48:13 [INFO] progress: Installing org.eclipse.rcptt.core.scenario
22:48:13 [INFO] progress: Installing org.eclipse.rcptt.runtime.feature.jar
22:48:13 [INFO] progress: Installing org.eclipse.rcptt.ctx.group
22:48:13 [INFO] progress: Installing org.eclipse.rcptt.ctx.preferences.aspects
22:48:13 [INFO] progress: Installing org.eclipse.emf.ecore.edit
22:48:13 [INFO] progress: Installing org.eclipse.emf.edit.feature.group
22:48:13 [INFO] progress: Installing org.eclipse.emf.transaction
22:48:13 [INFO] progress: Installing org.eclipse.rcptt.ecl.platform.feature.group
22:48:13 [INFO] progress: Installing org.eclipse.rcptt.tesla.jdt.aspects
22:48:13 [INFO] progress: Installing org.eclipse.emf.codegen.ecore.feature.jar
22:48:13 [INFO] progress: Installing org.eclipse.emf.mapping.ecore.editor.feature.group
22:48:13 [INFO] progress: Installing org.eclipse.emf.common.ui.feature.jar
22:48:13 [INFO] progress: Installing org.eclipse.rcptt.ctx.workbench.impl
22:48:13 [INFO] progress: Installing org.eclipse.rcptt.verifications.resources.impl
22:48:13 [INFO] progress: Installing org.eclipse.rcptt.tesla.core
22:48:13 [INFO] progress: Installing org.eclipse.rcptt.ecl.client.tcp
22:48:13 [INFO] progress: Installing org.eclipse.rcptt.tesla.workbench.aspects.e4x
22:48:14 [INFO] progress: Installing org.eclipse.emf.ecore.edit.feature.group
22:48:14 [INFO] progress: Installing org.eclipse.rcptt.ecl.platform.ui.feature.group
22:48:14 [INFO] progress: Installing org.eclipse.rcptt.tesla.workbench.texteditor
22:48:14 [INFO] progress: Installing org.eclipse.rcptt.tesla.ecl.impl
22:48:14 [INFO] progress: Installing org.eclipse.rcptt.tesla.ecl.runtime.feature.jar
22:48:14 [INFO] progress: Installing org.eclipse.rcptt.resources
22:48:14 [INFO] progress: Installing org.eclipse.rcptt.tesla.gmf.aspects
22:48:14 [INFO] progress: Installing org.eclipse.rcptt.tesla.core.context
22:48:14 [INFO] progress: Installing org.eclipse.rcptt.tesla.nebula.impl
22:48:14 [INFO] progress: Installing org.eclipse.emf.transaction.feature.jar
22:48:14 [INFO] progress: Installing org.eclipse.rcptt.tesla.jobs.aspects
22:48:14 [INFO] progress: Installing org.eclipse.rcptt.module.nebula.runtime.feature.group
22:48:14 [INFO] progress: Installing org.eclipse.rcptt.watson.runtime.feature.jar
22:48:14 [INFO] progress: Installing org.eclipse.rcptt.ctx.group.impl
22:48:14 [INFO] progress: Installing org.eclipse.rcptt.tesla.core.am
22:48:14 [INFO] progress: Installing org.eclipse.rcptt.tesla.runtime.feature.jar
22:48:14 [INFO] progress: Installing org.eclipse.emf.ecore.edit.feature.jar
22:48:14 [INFO] progress: Installing org.eclipse.emf.validation
22:48:14 [INFO] progress: Installing org.eclipse.rcptt.watson.aspects.swt
22:48:14 [INFO] progress: Installing org.eclipse.rcptt.tesla.ecl
22:48:14 [INFO] progress: Installing org.eclipse.emf.edit.ui
22:48:14 [INFO] progress: Installing org.eclipse.rcptt.tesla.canvas
22:48:14 [INFO] progress: Installing org.eclipse.emf.edit.feature.jar
22:48:15 [INFO] progress: Installing org.eclipse.equinox.weaving.aspectj
22:48:15 [INFO] progress: Installing org.eclipse.rcptt.tesla.swt.e4x
22:48:15 [INFO] progress: Installing org.eclipse.emf.validation.ui.ide
22:48:15 [INFO] progress: Installing org.eclipse.emf.edit
22:48:15 [INFO] progress: Installing org.eclipse.rcptt.ctx.debug
22:48:15 [INFO] progress: Installing org.eclipse.rcptt.tesla.jface.databinding
22:48:15 [INFO] progress: Installing config.a.jre.javase
22:48:15 [INFO] progress: Installing org.eclipse.rcptt.tesla.recording.aspects.jface.text
22:48:15 [INFO] progress: Installing file:/home/jenkins/agent/workspace/master/modules/testrail/runtime-site/target/site/site.xml.rcptt
22:48:15 [INFO] progress: Installing org.eclipse.rcptt.verifications.tree
22:48:15 [INFO] progress: Installing org.eclipse.emf.converter.feature.group
22:48:15 [INFO] progress: Installing org.eclipse.emf.databinding.edit.feature.group
22:48:15 [INFO] progress: Installing org.eclipse.emf.transaction.ui
22:48:15 [INFO] progress: Installing org.eclipse.emf.validation.feature.jar
22:48:15 [INFO] progress: Installing org.eclipse.emf.codegen.ecore
22:48:15 [INFO] progress: Installing org.eclipse.rcptt.tesla.ecl.runtime.feature.group
22:48:15 [INFO] progress: Installing org.eclipse.rcptt.core
22:48:15 [INFO] progress: Installing org.eclipse.rcptt.tesla.nebula.ecl.impl
22:48:15 [INFO] progress: Installing org.eclipse.rcptt.tesla.jface.text
22:48:15 [INFO] progress: Installing org.eclipse.emf.common.ui.feature.group
22:48:15 [INFO] progress: Installing org.apache.poi.ooxml.schemas
22:48:15 [INFO] progress: Installing org.eclipse.rcptt.tesla.ui.ide
22:48:15 [INFO] progress: Installing org.eclipse.rcptt.tesla.jface.text.reconciler.aspects
22:48:15 [INFO] progress: Installing org.eclipse.emf.ecore.change.edit
22:48:15 [INFO] progress: Installing org.eclipse.emf.mapping.ecore2ecore.editor
22:48:15 [INFO] progress: Installing org.eclipse.rcptt.forms.impl
22:48:15 [INFO] progress: Installing org.antlr.runtime
22:48:15 [INFO] progress: Installing org.eclipse.rcptt.tesla.ecl.feature.group
22:48:15 [INFO] progress: Installing org.eclipse.rcptt.tesla.jface.text.aspects
22:48:15 [INFO] progress: Installing org.eclipse.emf.databinding.edit
22:48:15 [INFO] progress: Installing org.eclipse.rcptt.watson.feature.jar
22:48:15 [INFO] progress: Installing org.eclipse.rcptt.ctx.parameters
22:48:15 [INFO] progress: Installing org.eclipse.emf.edit.ui.feature.group
22:48:15 [INFO] progress: Installing org.eclipse.rcptt.ctx.resources.impl
22:48:15 [INFO] progress: Installing org.eclipse.rcptt.verifications.resources
22:48:15 [INFO] progress: Installing org.eclipse.rcptt.tesla.swt.fragment
22:48:15 [INFO] progress: Installing org.eclipse.emf
22:48:15 [INFO] progress: Installing org.eclipse.rcptt.ecl.server.tcp
22:48:15 [INFO] progress: Installing org.eclipse.rcptt.tesla.recording.core
22:48:15 [INFO] progress: Installing org.eclipse.rcptt.tesla.properties.view
22:48:15 [INFO] progress: Installing org.eclipse.rcptt.testrail.ecl
22:48:15 [INFO] progress: Installing org.eclipse.emf.validation.ui
22:48:15 [INFO] progress: Installing org.eclipse.rcptt.tesla.recording.aspects.swt
22:48:15 [INFO] progress: Installing org.eclipse.emf.codegen.ecore.feature.group
22:48:15 [INFO] progress: Installing org.apache.xmlbeans
22:48:15 [INFO] progress: Installing org.eclipse.rcptt.logging
22:48:15 [INFO] progress: Installing org.eclipse.rcptt.tesla.jface.fragment
22:48:15 [INFO] progress: Installing org.eclipse.rcptt.tesla.feature.group
22:48:15 [INFO] progress: Installing org.eclipse.emf.mapping.ecore.feature.jar
22:48:15 [INFO] progress: Installing org.eclipse.rcptt.ecl.core
22:48:15 [INFO] progress: Installing org.eclipse.rcptt.core.swt.win64
22:48:15 [INFO] progress: Installing org.eclipse.rcptt.util.resources
22:48:15 [INFO] progress: Installing org.eclipse.emf.mapping.feature.group
22:48:15 [INFO] progress: Installing org.eclipse.equinox.weaving.hook
22:48:15 [INFO] progress: Installing org.eclipse.emf.edit.ui.feature.jar
22:48:15 [INFO] progress: Installing org.eclipse.rcptt.tesla.recording.canvas
22:48:15 [INFO] progress: Installing org.eclipse.emf.mapping.ui
22:48:15 [INFO] progress: Installing org.eclipse.rcptt.tesla.recording.swt
22:48:15 [INFO] progress: Installing org.eclipse.rcptt.ecl.dispatch
22:48:15 [INFO] progress: Installing org.eclipse.rcptt.verifications.tree.impl
22:48:15 [INFO] progress: Installing org.eclipse.rcptt.tesla.recording.aspects.gmf
22:48:16 [INFO] progress: Installing org.eclipse.rcptt.testrail.ecl.impl
22:48:16 [INFO] progress: Installing org.eclipse.rcptt.ctx.filesystem.impl
22:48:16 [INFO] progress: Installing org.eclipse.rcptt.watson.jface
22:48:16 [INFO] progress: Installing org.eclipse.rcptt.runtime.ui
22:48:16 [INFO] progress: Installing org.eclipse.rcptt.tesla.recording.aspects.gef
22:48:16 [INFO] progress: Installing org.eclipse.emf.importer.java
22:48:16 [INFO] progress: Installing org.eclipse.emf.codegen.feature.jar
22:48:16 [INFO] progress: Installing org.eclipse.emf.common
22:48:16 [INFO] progress: Installing org.eclipse.emf.mapping.ecore
22:48:16 [INFO] progress: Installing org.eclipse.emf.mapping.ecore.editor.feature.jar
22:48:16 [INFO] progress: Installing org.eclipse.emf.common.feature.jar
22:48:16 [INFO] progress: Installing org.eclipse.rcptt.tesla.feature.jar
22:48:16 [INFO] progress: Installing org.eclipse.rcptt.verifications.text.impl
22:48:16 [INFO] progress: Installing org.eclipse.emf.mapping.ecore2ecore
22:48:16 [INFO] progress: Installing org.eclipse.rcptt.core.ecl.debug
22:48:16 [INFO] progress: Installing org.eclipse.rcptt.ecl.filesystem
22:48:16 [INFO] progress: Installing org.eclipse.rcptt.resources.impl
22:48:16 [INFO] progress: Installing org.eclipse.emf.mapping.ecore.editor
22:48:16 [INFO] progress: Installing org.eclipse.rcptt.ctx.script.impl
22:48:16 [INFO] progress: Installing org.eclipse.emf.validation_root
22:48:17 [INFO] progress: Installing org.eclipse.emf.feature.jar
22:48:17 [INFO] progress: Installing org.eclipse.rcptt.ecl.core.feature.jar
22:48:17 [INFO] progress: Installing org.eclipse.rcptt.ecl.platform.feature.jar
22:48:17 [INFO] progress: Installing org.eclipse.rcptt.tesla.jdt
22:48:17 [INFO] progress: Installing org.eclipse.emf.importer.ecore
22:48:17 [INFO] progress: Installing org.eclipse.rcptt.tesla.jface.databinding.observable.aspects
22:48:17 [INFO] progress: Installing org.eclipse.emf.codegen.ecore.ui.feature.group
22:48:17 [INFO] progress: Installing org.eclipse.rcptt.module.nebula.runtime.feature.jar
22:48:17 [INFO] progress: Installing org.eclipse.emf.codegen.ecore.ui.feature.jar
22:48:17 [INFO] progress: Installing org.eclipse.rcptt.verifications.text
22:48:17 [INFO] progress: Installing org.eclipse.rcptt.expandbar
22:48:17 [INFO] progress: Installing org.eclipse.rcptt.tesla.recording.gef
22:48:17 [INFO] progress: Installing org.eclipse.rcptt.ecl.interop
22:48:17 [INFO] progress: Installing org.eclipse.rcptt.ecl.platform.ui
22:48:17 [INFO] progress: Installing org.eclipse.rcptt.tesla.ui.ide.aspects
22:48:17 [INFO] progress: Installing org.eclipse.rcptt.runtime.feature.group
22:48:17 [INFO] progress: Installing org.eclipse.rcptt.tesla.recording.gmf
22:48:17 [INFO] progress: Installing org.eclipse.rcptt.tesla.jface.aspects
22:48:17 [INFO] progress: Installing org.eclipse.rcptt.tesla.ecl.feature.jar
22:48:17 [INFO] progress: Installing org.eclipse.emf.feature.group
22:48:17 [INFO] progress: Installing org.eclipse.rcptt.core.launching
22:48:17 [INFO] progress: Installing org.eclipse.emf.mapping.ecore2xml
22:48:17 [INFO] progress: Installing org.eclipse.rcptt.module.testrail.runtime.feature.group
22:48:17 [INFO] progress: Installing org.eclipse.rcptt.tesla.swt.aspects
22:48:17 [INFO] progress: Installing org.eclipse.emf.mapping
22:48:17 [INFO] progress: Installing org.eclipse.rcptt.tesla.workbench.texteditor.aspects
22:48:17 [INFO] progress: Installing org.eclipse.rcptt.ecl.data.apache.poi.impl
22:48:17 [INFO] progress: Installing org.eclipse.rcptt.ctx.debug.impl
22:48:17 [INFO] progress: Installing org.eclipse.emf.exporter
22:48:17 [INFO] progress: Installing org.eclipse.rcptt.verifications.time
22:48:17 [INFO] progress: Installing org.eclipse.emf.converter.feature.jar
22:48:17 [INFO] progress: Installing org.eclipse.rcptt.ctx.workbench
22:48:17 [INFO] progress: Installing org.eclipse.rcptt.tesla.variables
22:48:17 [INFO] progress: Installing org.eclipse.rcptt.tesla.recording.workbench.texteditor
22:48:17 [INFO] progress: Installing org.eclipse.rcptt.watson.core
22:48:17 [INFO] progress: Installing org.eclipse.emf.transaction_root
22:48:17 [INFO] progress: Installing org.eclipse.rcptt.tesla.recording.jface.text
22:48:17 [INFO] progress: Installing org.eclipse.emf.databinding.edit.feature.jar
22:48:17 [INFO] progress: Installing org.eclipse.rcptt.expandbar.runtime
22:48:17 [INFO] progress: Installing org.eclipse.rcptt.tesla.jface.databinding.aspects
22:48:17 [INFO] progress: Installing org.eclipse.rcptt.tesla.gef.aspects
22:48:17 [INFO] progress: Installing org.eclipse.rcptt.tesla.nebula
22:48:17 [INFO] progress: Installing org.eclipse.emf.ant
22:48:17 [INFO] progress: Installing org.aspectj.runtime
22:48:17 [INFO] progress: Installing org.eclipse.emf.codegen.ecore.ui
22:48:17 [INFO] progress: Installing org.eclipse.rcptt.util.swt
22:48:17 [INFO] progress: Installing org.eclipse.rcptt.verifications.time.impl
22:48:17 [INFO] progress: Installing org.eclipse.rcptt.ecl.core.feature.group
22:48:17 [INFO] progress: Installing org.eclipse.rcptt.ecl.platform.ui.feature.jar
22:48:17 [INFO] progress: Installing org.apache.poi
22:48:17 [INFO] progress: Installing org.eclipse.emf.transaction.feature.group
22:48:17 [INFO] progress: Installing org.eclipse.emf.codegen
22:48:17 [INFO] progress: Installing org.eclipse.emf.codegen.ui
22:48:17 [INFO] progress: Installing org.eclipse.rcptt.ecl.debug.runtime
22:48:17 [INFO] progress: Installing org.eclipse.rcptt.util
22:48:17 [INFO] progress: Installing org.eclipse.emf.converter
22:48:17 [INFO] progress: Installing org.eclipse.emf.ecore.feature.group
22:48:17 [INFO] progress: Installing org.eclipse.rcptt.verifications.log.impl
22:48:17 [INFO] progress: Installing 202006170330.Default
22:48:17 [INFO] progress: Installing org.eclipse.emf.mapping.ecore.feature.group
22:48:17 [INFO] progress: Installing org.eclipse.emf.mapping.ui.feature.group
22:48:17 [INFO] progress: Installing org.eclipse.rcptt.ecl.data
22:48:17 [INFO] progress: Installing org.eclipse.rcptt.verifications.log
22:48:17 [INFO] progress: Installing org.eclipse.rcptt.watson.runtime.feature.group
22:48:17 [INFO] progress: Installing org.eclipse.rcptt.tesla.swt
22:48:17 [INFO] progress: Installing org.eclipse.rcptt.tesla.recording.aspects.workbench.texteditor
22:48:17 [INFO] progress: Installing org.eclipse.rcptt.ecl.operations
22:48:18 [INFO] progress: Installing org.eclipse.rcptt.ctx.workbench.aspect
22:48:18 [INFO] progress: Installing org.eclipse.emf.codegen.feature.group
22:48:18 [INFO] progress: Installing a.jre.javase
22:48:18 [INFO] progress: Installing org.eclipse.emf.codegen.ui.feature.jar
22:48:18 [INFO] progress: Installing org.eclipse.emf.ecore.editor.feature.group
22:48:18 [INFO] progress: Installing org.eclipse.rcptt.ctx.resources
22:48:18 [INFO] progress: Installing org.eclipse.emf.mapping.ui.feature.jar
22:48:18 [INFO] progress: Installing org.apache.poi.ooxml
22:48:18 [INFO] progress: Installing org.eclipse.emf.ecore
22:48:18 [INFO] progress: Installing org.eclipse.emf.common.feature.group
22:48:18 [INFO] progress: Installing org.eclipse.rcptt.tesla.recording.aspects.workbench
22:48:18 [INFO] progress: Installing org.eclipse.emf.databinding
22:48:18 [INFO] progress: Installing org.eclipse.rcptt.watson.feature.group
22:48:18 [INFO] progress: Installing org.eclipse.emf.databinding.feature.group
22:48:18 [INFO] progress: Installing org.eclipse.rcptt.ctx.preferences
22:48:18 [INFO] progress: Installing org.eclipse.rcptt.ecl.perf
22:48:18 [INFO] progress: Installing org.eclipse.rcptt.tesla.nebula.ecl
22:48:18 [INFO] progress: Installing org.eclipse.emf.databinding.feature.jar
22:48:18 [INFO] progress: Installing org.eclipse.rcptt.tesla.recording.aspects.forms
22:48:18 [INFO] progress: Installing org.eclipse.emf.ecore.editor.feature.jar
22:48:18 [INFO] progress: Installing org.eclipse.rcptt.tesla.recording.nebula
22:48:18 [INFO] progress: Installing org.eclipse.rcptt.tesla.recording.aspects.draw2d
22:48:18 [INFO] progress: Installing org.eclipse.emf.ecore.feature.jar
22:48:18 [INFO] progress: Installing org.aspectj.weaver
22:48:18 [INFO] progress: Installing file:/home/jenkins/agent/workspace/master/modules/nebula/runtime-site/target/site/site.xml.rcptt
22:48:18 [INFO] progress: Installing org.eclipse.emf.codegen.ui.feature.group
22:48:18 [INFO] progress: Installing org.eclipse.rcptt.module.testrail.runtime.feature.jar
22:48:18 [INFO] progress: Installing org.eclipse.emf.validation.feature.group
22:48:18 [INFO] progress: Installing org.eclipse.rcptt.ecl.platform
22:48:18 [INFO] progress: Installing org.eclipse.rcptt.ecl.server.feature.group
22:48:18 [INFO] progress: Installing org.eclipse.rcptt.tesla.recording.aspects.jface
22:48:18 [INFO] progress: Installing org.eclipse.rcptt.tesla.gef
22:48:18 [INFO] progress: Installing org.eclipse.rcptt.watson.jobs
22:48:19 [INFO] progress: Installing org.eclipse.rcptt.core.swt
22:48:19 [INFO] progress: Installing org.eclipse.rcptt.core.ecl.core
22:48:19 [INFO] progress: Installing org.eclipse.rcptt.ecl.data.apache.poi
22:48:19 [INFO] progress: Installing org.eclipse.emf.importer.rose
22:48:19 [INFO] progress: Installing org.eclipse.emf.common.ui
22:48:19 [INFO] progress: Installing org.eclipse.rcptt.verifications
22:48:19 [INFO] progress: Installing org.eclipse.emf.ecore.editor
22:48:19 [INFO] progress: Downloading org.eclipse.emf.validation_root
22:48:19 [INFO] progress: Downloading org.eclipse.emf.transaction_root
22:48:19 [INFO] progress: Preparing to commit the provisioning operation.
22:48:19 [INFO] progress: Committing the provisioning operation.
22:48:19 [INFO] progress: Reading plug-ins
22:48:24 [INFO] Target platform is valid.
22:48:24 [INFO] Looking for tests...
22:48:24 [INFO] Existing projects in workspace:
22:48:24 [INFO]     <none>
22:48:24 [INFO] Importing projects to workspace:
22:48:24 [INFO] Refreshing projects:
22:48:24 [INFO]     C:\jenkins\build\workspace\elexis-uitest-windows\KernFunktionen\target\projects\KernFunktionen... OK
22:48:24 [INFO] Refreshing projects:
22:48:24 [INFO]     KernFunktionen... OK
22:48:24 [INFO] Searching for tests in projects:
22:48:24 [INFO]     KernFunktionen... 
22:48:34 [INFO] Complete OK
22:48:34 [INFO] Testcase Artifacts:30
22:48:34 [INFO] AUT-0:Launching
22:48:35 [INFO] AUT-0:Product: ch.elexis.core.application.product
22:48:35 [INFO] AUT-0:Application: ch.elexis.core.application.ElexisApp
22:48:35 [INFO] AUT-0:Architecture: x86_64
22:48:35 [INFO] 64bit arch is selected because AUT uses launcher library
22:48:35 [INFO] 	"plugins/org.eclipse.equinox.launcher.win32.win32.x86_64_1.1.1100.v20190907-0426" specified in config file: Elexis3.ini
22:48:35 [INFO] C:\jenkins\build\workspace\elexis-uitest-windows\KernFunktionen\target\aut-ws-0: AUT arguments: -nl de_CH -nosplash -noregtool --use-config=rpctt -os ${target.os} -arch ${target.arch} -consoleLog
22:48:35 [INFO] C:\jenkins\build\workspace\elexis-uitest-windows\KernFunktionen\target\aut-ws-0: AUT VM arguments: -Xms256m -Xmx1024m -Duser.language=de -Duser.region=CH -Dfile.encoding=utf-8 -Dorg.eclipse.gemini.refreshBundles=false -Djava.library.path=/usr/lib/jni -DGTK_IM_MODULE=ibus -Dlanguage=de -Duser.language=de -Dch.elexis.dbFlavor=h2 -Dch.elexis.dbSpec=jdbc:h2:C:\Users\nikla/elexis/h2_elexis_rcptt_de/db -Dch.elexis.dbUser=sa -Dch.elexis.dbPw= -Dch.elexis.firstMandantName=Mustermann -Dch.elexis.firstMandantPassword=elexisTest -Dch.elexis.firstMandantEmail=mmustermann@elexis.info -Dch.elexis.username=Mustermann -Dch.elexis.password=elexisTest -DvmArg10 -XX:MaxPermSize=128m
22:48:35 [INFO] Trying to use VM from application's ini file: plugins/ch.elexis.jre.win32.x86_64_1.8.252/jre/bin
22:48:35 [INFO] Unknown file system layout of Java VM from ini file
22:51:03 [INFO] AUT-0: Launch failed. Reason: Process was terminated while waiting for AUT startup data
22:51:03 [INFO] AUT-0: For more information check AUT output at 'C:\jenkins\build\workspace\elexis-uitest-windows\KernFunktionen\target\results\aut-console-0_console.log'
22:51:03 [INFO] Failed to launch AUT:AUT-0: Launch failed. Reason: Process was terminated while waiting for AUT startup data
22:51:03 [INFO] AUT-0:Launching
22:51:03 [INFO] AUT-0:Product: ch.elexis.core.application.product
22:51:03 [INFO] AUT-0:Application: ch.elexis.core.application.ElexisApp
22:51:03 [INFO] AUT-0:Architecture: x86_64
22:51:03 [INFO] 64bit arch is selected because AUT uses launcher library
22:51:03 [INFO] 	"plugins/org.eclipse.equinox.launcher.win32.win32.x86_64_1.1.1100.v20190907-0426" specified in config file: Elexis3.ini
22:51:03 [INFO] C:\jenkins\build\workspace\elexis-uitest-windows\KernFunktionen\target\aut-ws-0: AUT arguments: -nl de_CH -nosplash -noregtool --use-config=rpctt -os ${target.os} -arch ${target.arch} -consoleLog
22:51:03 [INFO] C:\jenkins\build\workspace\elexis-uitest-windows\KernFunktionen\target\aut-ws-0: AUT VM arguments: -Xms256m -Xmx1024m -Duser.language=de -Duser.region=CH -Dfile.encoding=utf-8 -Dorg.eclipse.gemini.refreshBundles=false -Djava.library.path=/usr/lib/jni -DGTK_IM_MODULE=ibus -Dlanguage=de -Duser.language=de -Dch.elexis.dbFlavor=h2 -Dch.elexis.dbSpec=jdbc:h2:C:\Users\nikla/elexis/h2_elexis_rcptt_de/db -Dch.elexis.dbUser=sa -Dch.elexis.dbPw= -Dch.elexis.firstMandantName=Mustermann -Dch.elexis.firstMandantPassword=elexisTest -Dch.elexis.firstMandantEmail=mmustermann@elexis.info -Dch.elexis.username=Mustermann -Dch.elexis.password=elexisTest -DvmArg10 -XX:MaxPermSize=128m
22:51:03 [INFO] Trying to use VM from application's ini file: plugins/ch.elexis.jre.win32.x86_64_1.8.252/jre/bin
22:51:03 [INFO] Unknown file system layout of Java VM from ini file
22:53:24 [INFO] Pass 1 (30) processed. 0 failed. spent: 0:33, 5:08 mins remaining. LOwriterMustBeInstalled. time: 29304ms 
22:53:47 [INFO] Pass 2 (30) processed. 0 failed. spent: 0:58, 6:31 mins remaining. OOWriterMustBeInstalled. time: 22804ms 
22:54:28 [INFO] Pass 3 (30) processed. 0 failed. spent: 1:36, 8:19 mins remaining. AboutElexis. time: 34571ms 
22:54:43 [INFO] Pass 4 (30) processed. 0 failed. spent: 1:53, 7:50 mins remaining. NoPreferenceWithPercent. time: 14540ms 
22:54:57 [INFO] Pass 5 (30) processed. 0 failed. spent: 2:08, 7:18 mins remaining. NoViewWithPercent. time: 12367ms 
22:55:19 [INFO] Pass 6 (30) processed. 0 failed. spent: 2:29, 7:08 mins remaining. CreateFemalePatient. time: 18288ms 
22:56:51 [INFO] Pass 7 (30) processed. 0 failed. spent: 3:59, 9:44 mins remaining. ImportAnalysenListe. time: 85327ms 
22:57:39 [INFO] Pass 8 (30) processed. 0 failed. spent: 4:49, 10:06 mins remaining. ImportBlocks. time: 46532ms 
22:58:22 [INFO] Pass 9 (30) processed. 0 failed. spent: 5:32, 11:37 mins remaining. ImportComplementary. time: 40678ms 
22:59:05 [INFO] Pass 10 (30) processed. 0 failed. spent: 6:16, 9:55 mins remaining. ImportKK_Patients. time: 40358ms 
23:01:57 [INFO] Pass 11 (30) processed. 0 failed. spent: 9:07, 12:37 mins remaining. ImportTarmed. time: 165731ms 
23:03:05 [INFO] Pass 12 (30) processed. 0 failed. spent: 10:14, 12:25 mins remaining. ImportArtikelstamm. time: 63691ms 
23:03:49 [INFO] Pass 13 (30) processed. 0 failed. spent: 11:00, 11:44 mins remaining. ImportMigel. time: 40967ms 
23:05:30 [INFO] Pass 14 (30) processed. 0 failed. spent: 12:40, 11:52 mins remaining. BasicMandanten. time: 94633ms 
23:06:11 [INFO] Pass 15 (30) processed. 0 failed. spent: 13:21, 10:59 mins remaining. BasicAbrechnungssytems. time: 38565ms 
23:06:46 [INFO] Pass 16 (30) processed. 0 failed. spent: 13:56, 10:03 mins remaining. CreateSQLdump. time: 33817ms 
23:06:59 [INFO] Pass 17 (30) processed. 0 failed. spent: 14:07, 8:54 mins remaining. RestartElexis. time: 8562ms 
23:07:04 [INFO] Fail 18 (30) processed. 1 failed. spent: 14:12, 8:58 mins remaining. CheckRestart. time: 3968ms  Cause: Failed to apply context Close modal dialogs
23:09:26 [INFO] Fail 19 (30) processed. 2 failed. spent: 16:35, 7:53 mins remaining. VerrechnenBeiGeschlossenemFall. time: 51240ms  Cause: Error saving screenshot: C:\jenkins\build\workspace\elexis-uitest-windows\KernFunktionen\target\aut\..\results\images\Fall_check_KVG.*14.10.2018.*offen.*.png (Die Syntax für den Dateinamen, Verzeichnisnamen oder die Datenträgerbezeichnung ist falsch)
23:10:00 [INFO] Fail 20 (30) processed. 3 failed. spent: 17:08, 7:00 mins remaining. KonsDirektVerrechnen. time: 30587ms  Cause: Error saving screenshot: C:\jenkins\build\workspace\elexis-uitest-windows\KernFunktionen\target\aut\..\results\images\Fall_check_KVG.*30.01.2020.*offen.*.png (Die Syntax für den Dateinamen, Verzeichnisnamen oder die Datenträgerbezeichnung ist falsch)
23:10:28 [INFO] Fail 21 (30) processed. 4 failed. spent: 17:39, 6:08 mins remaining. TarmedFallVerrechnen. time: 27924ms  Cause: Error saving screenshot: C:\jenkins\build\workspace\elexis-uitest-windows\KernFunktionen\target\aut\..\results\images\Fall_check_KVG.*14.10.2018.*offen.*.png (Die Syntax für den Dateinamen, Verzeichnisnamen oder die Datenträgerbezeichnung ist falsch)
23:11:19 [INFO] Fail 22 (30) processed. 5 failed. spent: 18:27, 5:22 mins remaining. SetupTextPluginTests. time: 45064ms  Cause: Failed to set selection: [[OpenOffice.*]].
23:13:58 [INFO] Fail 23 (30) processed. 6 failed. spent: 21:09, 6:10 mins remaining. CheckTarmedFallVerrechnen. time: 148430ms  Cause: Error saving screenshot: C:\jenkins\build\workspace\elexis-uitest-windows\KernFunktionen\target\aut\..\results\images\Fall_check_KVG.*14.10.2018.*offen.*.png (Die Syntax für den Dateinamen, Verzeichnisnamen oder die Datenträgerbezeichnung ist falsch)
23:14:32 [INFO] Fail 24 (30) processed. 7 failed. spent: 21:43, 4:10 mins remaining. BasicKonsTests. time: 30311ms  Cause: Error saving screenshot: C:\jenkins\build\workspace\elexis-uitest-windows\KernFunktionen\target\aut\..\results\images\Fall_check_KVG.*14.10.2018.*offen.*.png (Die Syntax für den Dateinamen, Verzeichnisnamen oder die Datenträgerbezeichnung ist falsch)
23:16:04 [INFO] Pass 25 (30) processed. 7 failed. spent: 23:13, 3:26 mins remaining. Kassenbuch. time: 85922ms 
23:16:42 [INFO] Fail 26 (30) processed. 8 failed. spent: 23:51, 2:33 mins remaining. hilotec_odf_aut. time: 34471ms  Cause: Error saving screenshot: C:\jenkins\build\workspace\elexis-uitest-windows\KernFunktionen\target\aut\..\results\images\Fall_check_KVG.*14.10.2018.*offen.*.png (Die Syntax für den Dateinamen, Verzeichnisnamen oder die Datenträgerbezeichnung ist falsch)
23:17:00 [INFO] Fail 27 (30) processed. 9 failed. spent: 24:11, 1:40 mins remaining. medelexis_oo. time: 17448ms  Cause: Failed to set selection: [[OpenOffice.*]].
23:18:12 [INFO] Pass 28 (30) processed. 9 failed. spent: 25:23, 0:50 mins remaining. TimeTool. time: 66162ms 
23:23:13 [INFO] Fail 29 (30) processed. 10 failed. spent: 30:21, 0:00 mins remaining. VisitMostPreferences. time: 295412ms  Cause: Button apply and close must be enabled for 1,Omnivore
23:46:24 Process 1608846384001 is killed.
23:46:24 [INFO] ------------------------------------------------------------------------
23:46:24 [INFO] Reactor Summary:
23:46:24 [INFO] 
23:46:24 [INFO] elexis-master 3.9 .................................. SUCCESS [04:16 min]
23:46:24 [INFO] setup 0.1 .......................................... SUCCESS [ 18.427 s]
23:46:24 [INFO] KernFunktionen 0.1 ................................. FAILURE [  01:01 h]
23:46:24 [INFO] h2 0.1 ............................................. SKIPPED
23:46:24 [INFO] ------------------------------------------------------------------------
23:46:24 [INFO] BUILD FAILURE
23:46:24 [INFO] ------------------------------------------------------------------------
23:46:24 [INFO] Total time:  01:06 h
23:46:24 [INFO] Finished at: 2020-12-24T23:46:24+01:00
23:46:24 [INFO] ------------------------------------------------------------------------
23:46:24 [ERROR] Failed to execute goal org.eclipse.rcptt:rcptt-maven-plugin:2.5.1:execute (default-execute) on project KernFunktionen: Failed to launch RCPTT runner: Error while executing external command, process killed. Process timeout out after 3600 seconds -> [Help 1]
23:46:24 [ERROR] 
23:46:24 [ERROR] To see the full stack trace of the errors, re-run Maven with the -e switch.
23:46:24 [ERROR] Re-run Maven using the -X switch to enable full debug logging.
23:46:24 [ERROR] 
23:46:24 [ERROR] For more information about the errors and possible solutions, please read the following articles:
23:46:24 [ERROR] [Help 1] http://cwiki.apache.org/confluence/display/MAVEN/MojoExecutionException
23:46:24 [ERROR] 
23:46:24 [ERROR] After correcting the problems, you can resume the build with the command
23:46:24 [ERROR]   mvn <goals> -rf :KernFunktionen
23:46:28 [INFO] Process terminated. Send shutdown request to RCPTT runner.
23:46:28 [INFO] Process terminated. Shut down AUTs
23:46:30 Build step 'Maven Goals aufrufen' marked build as failure
23:46:37 Archiviere Artefakte
23:47:15 Started calculate disk usage of build
23:47:15 Finished Calculation of disk usage of build in 0 seconds
23:47:15 Started calculate disk usage of workspace
23:47:19 Finished Calculation of disk usage of workspace in  4 second
23:47:19 Finished: FAILURE