Console Output

18:00:03 Gestartet durch Benutzer Niklaus Giger
18:00:03 Running as SYSTEM
18:00:03 Baue auf dem Agenten „Elexis-WIndows-10“ (windows) in Arbeitsbereich C:\Jenkins\build\workspace\elexis-uitest-windows
18:00:03 The recommended git tool is: NONE
18:00:03 No credentials specified
18:00:03  > git rev-parse --resolve-git-dir C:\Jenkins\build\workspace\elexis-uitest-windows\.git # timeout=10
18:00:03 Fetching changes from the remote Git repository
18:00:03  > git config remote.origin.url http://github.com/elexis/elexis-uitest.git # timeout=10
18:00:03 Fetching upstream changes from http://github.com/elexis/elexis-uitest.git
18:00:03  > git --version # timeout=10
18:00:03  > git --version # 'git version 2.32.0.windows.1'
18:00:03  > git fetch --tags --force --progress -- http://github.com/elexis/elexis-uitest.git +refs/heads/*:refs/remotes/origin/* # timeout=10
18:00:08  > git rev-parse "refs/remotes/origin/master^{commit}" # timeout=10
18:00:08 Checking out Revision d42489321c5bd23652415c0fc32abbf49f5ea50c (refs/remotes/origin/master)
18:00:08  > git config core.sparsecheckout # timeout=10
18:00:09  > git checkout -f d42489321c5bd23652415c0fc32abbf49f5ea50c # timeout=10
18:00:09 Commit message: "Init LOINC early. Fix set standard diagnosis"
18:00:09  > git rev-list --no-walk d42489321c5bd23652415c0fc32abbf49f5ea50c # timeout=10
18:00:09 [elexis-uitest-windows] $ cmd.exe /C "C:\Jenkins\build\tools\hudson.tasks.Maven_MavenInstallation\3.6.0\bin\mvn.cmd -V clean verify -f h2/pom.xml --settings h2/settings.xml -Dsuite2run=SmokeTestSuite && exit %%ERRORLEVEL%%"
18:00:09 Apache Maven 3.6.0 (97c98ec64a1fdfee7767ce5ffb20918da4f719f3; 2018-10-24T18:41:47Z)
18:00:09 Maven home: C:\Jenkins\build\tools\hudson.tasks.Maven_MavenInstallation\3.6.0\bin\..
18:00:09 Java version: 1.8.0_292, vendor: Oracle Corporation, runtime: C:\Program Files\OpenJDK\openjdk-8u292-b10\jre
18:00:09 Default locale: en_US, platform encoding: Cp1252
18:00:09 OS name: "windows 10", version: "10.0", arch: "amd64", family: "windows"
18:00:10 [INFO] Scanning for projects...
18:00:12 [WARNING] No explicit target runtime environment configuration. Build is platform dependent.
18:00:14 [INFO] Computing target platform for MavenProject: ch.elexis.rcptt:elexis-master:3.9 @ C:\Jenkins\build\workspace\elexis-uitest-windows\elexis-master\pom.xml
18:00:15 [INFO] Fetching p2.index from https://download.elexis.info/elexis/master/p2/elexis-3-core/ (173B)
18:00:15 [INFO] Adding repository https://download.elexis.info/elexis/master/p2/elexis-3-core
18:00:15 [INFO] Fetching p2.index from https://download.elexis.info/elexis/master/p2/elexis-3-base/ (173B)
18:00:16 [INFO] Adding repository https://download.elexis.info/elexis/master/p2/elexis-3-base
18:00:16 [INFO] Fetching content.xml.xz from https://download.elexis.info/elexis/master/p2/elexis-3-base/ (42.62kB)
18:00:16 [INFO] Adding repository https://download.elexis.info/elexis/master/p2/target
18:00:16 [INFO] Resolving dependencies of MavenProject: ch.elexis.rcptt:elexis-master:3.9 @ C:\Jenkins\build\workspace\elexis-uitest-windows\elexis-master\pom.xml
18:00:17 [INFO] Fetching at.medevit.elexis.epha.interactions_3.1.0.20210608-1553.jar from https://download.elexis.info/elexis/master/p2/elexis-3-base/plugins/ (21.97kB)
18:00:17 [INFO] Fetching at.medevit.elexis.decision.feature_3.0.100.20210608-1553.jar from https://download.elexis.info/elexis/master/p2/elexis-3-base/features/ (915B)
18:00:18 [INFO] Resolving class path of MavenProject: ch.elexis.rcptt:elexis-master:3.9 @ C:\Jenkins\build\workspace\elexis-uitest-windows\elexis-master\pom.xml
18:00:19 [INFO] ------------------------------------------------------------------------
18:00:19 [INFO] Reactor Build Order:
18:00:19 [INFO] 
18:00:19 [INFO] elexis-master                                       [eclipse-repository]
18:00:19 [INFO] setup                                                              [pom]
18:00:19 [INFO] KernFunktionen                                               [rcpttTest]
18:00:19 [INFO] h2                                                                 [pom]
18:00:19 [INFO] 
18:00:19 [INFO] -------------------< ch.elexis.rcptt:elexis-master >--------------------
18:00:19 [INFO] Building elexis-master 3.9                                         [1/4]
18:00:19 [INFO] -------------------------[ eclipse-repository ]-------------------------
18:00:19 [INFO] 
18:00:19 [INFO] --- maven-clean-plugin:2.5:clean (default-clean) @ elexis-master ---
18:00:19 [INFO] Deleting C:\Jenkins\build\workspace\elexis-uitest-windows\elexis-master\target
18:00:20 [INFO] 
18:00:20 [INFO] --- tycho-packaging-plugin:1.7.0:build-qualifier-aggregator (default-build-qualifier-aggregator) @ elexis-master ---
18:00:20 [INFO] The project's OSGi version is 3.9.0
18:00:20 [INFO] 
18:00:20 [INFO] --- maven-clean-plugin:2.5:clean (default-clean-1) @ elexis-master ---
18:00:20 [INFO] 
18:00:20 [INFO] --- maven-resources-plugin:2.4.3:resources (default-resources) @ elexis-master ---
18:00:21 [INFO] Using 'UTF-8' encoding to copy filtered resources.
18:00:21 [INFO] skip non existing resourceDirectory C:\Jenkins\build\workspace\elexis-uitest-windows\elexis-master\src\main\resources
18:00:21 [INFO] 
18:00:21 [INFO] --- target-platform-configuration:1.7.0:target-platform (default-target-platform) @ elexis-master ---
18:00:21 [INFO] 
18:00:21 [INFO] --- tycho-p2-publisher-plugin:1.7.0:publish-osgi-ee (default-publish-osgi-ee) @ elexis-master ---
18:00:21 [INFO] Published profile IUs: [a.jre.javase 11.0.0, config.a.jre.javase 11.0.0]
18:00:21 [INFO] Published profile IUs: [a.jre.javase 14.0.0, config.a.jre.javase 14.0.0]
18:00:21 [INFO] 
18:00:21 [INFO] --- tycho-p2-publisher-plugin:1.7.0:publish-products (default-publish-products) @ elexis-master ---
18:00:21 [INFO] 
18:00:21 [INFO] --- tycho-p2-publisher-plugin:1.7.0:publish-categories (default-publish-categories) @ elexis-master ---
18:00:21 [INFO] 
18:00:21 [INFO] --- tycho-p2-publisher-plugin:1.7.0:attach-artifacts (default-attach-artifacts) @ elexis-master ---
18:00:21 [INFO] 
18:00:21 [INFO] --- tycho-p2-repository-plugin:1.7.0:assemble-repository (default-assemble-repository) @ elexis-master ---
18:00:56 [INFO] 
18:00:56 [INFO] --- tycho-p2-repository-plugin:1.7.0:archive-repository (default-archive-repository) @ elexis-master ---
18:00:56 [INFO] Building zip: C:\Jenkins\build\workspace\elexis-uitest-windows\elexis-master\target\elexis-master-3.9.zip
18:01:01 [INFO] 
18:01:01 [INFO] --- tycho-p2-director-plugin:1.7.0:materialize-products (materialize-products) @ elexis-master ---
18:01:01 [INFO] Installing product ElexisAllOpenSourceApp for environment win32/win32/x86_64 to C:\Jenkins\build\workspace\elexis-uitest-windows\elexis-master\target\products\ElexisAllOpenSourceApp\win32\win32\x86_64
18:01:02 Installing ElexisAllOpenSourceApp 3.9.0.
18:01:02 Installing at.gruber.elexis.mythic22.feature.feature.group 3.0.100.20201021-1138.
18:01:02 Installing at.medevit.elexis.agenda.feature.feature.group 1.0.100.20210519-1401.
18:01:02 Installing at.medevit.elexis.bluemedication.feature.feature.group 1.0.0.20201112-0828.
18:01:02 Installing at.medevit.elexis.cobasmira.feature.feature.group 3.0.100.20181207-1630.
18:01:02 Installing at.medevit.elexis.decision.feature.feature.group 3.0.100.20210608-1553.
18:01:02 Installing at.medevit.elexis.ehc.feature.feature.group 3.3.100.20210406-1157.
18:01:02 Installing at.medevit.elexis.emediplan.feature.feature.group 1.0.100.20210322-1429.
18:01:02 Installing at.medevit.elexis.gdt.defaultfilecp.feature.feature.group 3.1.100.20210203-1354.
18:01:02 Installing at.medevit.elexis.gdt.feature.feature.group 3.1.100.20210203-1354.
18:01:02 Installing at.medevit.elexis.impfplan.feature.feature.group 3.8.0.20210528-0841.
18:01:02 Installing at.medevit.elexis.inbox.feature.feature.group 3.0.100.20210122-1540.
18:01:02 Installing at.medevit.elexis.loinc.feature.feature.group 3.0.100.20200623-0838.
18:01:02 Installing at.medevit.elexis.medietikette.feature.feature.group 3.0.100.20200129-1200.
18:01:02 Installing ch.berchtold.privatrechnung.feature.feature.group 3.0.100.20210503-0656.
18:01:02 Installing ch.docbox.elexis.feature.feature.group 3.0.100.20210406-1157.
18:01:02 Installing ch.elexis.agenda.feature.feature.group 3.2.100.20210427-0818.
18:01:02 Installing ch.elexis.archie.patientstatistik.feature.feature.group 3.0.100.20201019-1344.
18:01:02 Installing ch.elexis.archie.wzw.feature.feature.group 3.0.100.20210421-1209.
18:01:02 Installing ch.elexis.barcode.scanner.feature.feature.group 3.2.100.20201021-1138.
18:01:02 Installing ch.elexis.base.befunde.feature.feature.group 3.0.100.20210525-0837.
18:01:02 Installing ch.elexis.base.ch.feature.feature.group 3.2.100.20210608-0841.
18:01:02 Installing ch.elexis.base.konsextension.bildanzeige.feature.feature.group 3.0.100.20181130-1349.
18:01:02 Installing ch.elexis.base.konsextension.privatnotizen.feature.feature.group 3.0.100.20181130-1343.
18:01:02 Installing ch.elexis.base.messages.feature.feature.group 3.0.100.20201021-1138.
18:01:02 Installing ch.elexis.base.messages.feature.feature.group 3.0.100.20201021-1138.
18:01:02 Installing ch.elexis.base.textplugin.feature.feature.group 3.0.100.20180614-0933.
18:01:02 Installing ch.elexis.base.textplugin.feature.feature.group 3.0.100.20180614-0933.
18:01:02 Installing ch.elexis.buchhaltung.basis.feature.feature.group 3.0.100.20190409-1417.
18:01:02 Installing ch.elexis.connect.afinion.feature.feature.group 3.0.100.20190409-1417.
18:01:02 Installing ch.elexis.connect.mythic.feature.feature.group 3.0.100.20210422-1002.
18:01:02 Installing ch.elexis.connect.reflotron.v2.feature.feature.group 3.0.100.20190409-1417.
18:01:02 Installing ch.elexis.connect.sysmex.feature.feature.group 3.0.100.20200417-1322.
18:01:02 Installing ch.elexis.connector.medicosearch.feature.feature.group 3.0.100.20200901-1213.
18:01:02 Installing ch.elexis.externe_dokumente.feature.feature.group 3.0.100.20200901-1913.
18:01:02 Installing ch.elexis.fop_wrapper.feature.feature.group 3.0.100.20200108-1208.
18:01:02 Installing ch.elexis.global_inbox.feature.feature.group 3.8.0.20210518-1054.
18:01:02 Installing ch.elexis.hl7.message.feature.feature.group 1.0.0.20200831-1449.
18:01:02 Installing ch.elexis.icpc.feature.feature.group 3.2.100.20200501-1250.
18:01:02 Installing ch.elexis.icpc.fire.feature.feature.group 3.2.100.20200901-1213.
18:01:02 Installing ch.elexis.impfplan.feature.feature.group 3.0.100.20191209-0913.
18:01:02 Installing ch.elexis.importer.aeskulap.feature.feature.group 1.0.0.20191209-0913.
18:01:02 Installing ch.elexis.kassenbuch.feature.feature.group 3.2.0.20201203-1605.
18:01:02 Installing ch.elexis.laborimport.analytica.feature.feature.group 3.1.100.20200831-1449.
18:01:02 Installing ch.elexis.laborimport.bioanalytica.feature.feature.group 3.0.100.20190411-1739.
18:01:02 Installing ch.elexis.laborimport.eurolyser.feature.feature.group 3.0.100.20201002-0856.
18:01:02 Installing ch.elexis.laborimport.hl7.allg.feature.feature.group 3.0.100.20210309-1518.
18:01:02 Installing ch.elexis.laborimport.medics.v2.feature.feature.group 3.0.100.20210309-1533.
18:01:02 Installing ch.elexis.laborimport.synlab.feature.feature.group 3.0.100.20190416-1030.
18:01:02 Installing ch.elexis.laborimport.teamw.feature.feature.group 3.1.100.20210203-1411.
18:01:02 Installing ch.elexis.laborimport.viollier.v2.feature.feature.group 3.0.100.20201002-0856.
18:01:02 Installing ch.elexis.laborimport_labtop.feature.feature.group 3.0.100.20180614-0933.
18:01:02 Installing ch.elexis.laborimport_lg1.feature.feature.group 3.0.100.20180614-0933.
18:01:02 Installing ch.elexis.laborimport_rischbern.feature.feature.group 3.0.100.20180614-0933.
18:01:02 Installing ch.elexis.laborimport_rothen.feature.feature.group 3.0.100.20180614-0933.
18:01:02 Installing ch.elexis.laborimport_viollier.feature.feature.group 3.0.100.20180309-1216.
18:01:02 Installing ch.elexis.labororder.lg1.feature.feature.group 1.0.0.20210406-1157.
18:01:02 Installing ch.elexis.molemax.feature.feature.group 3.0.100.20190128-1451.
18:01:02 Installing ch.elexis.notes.feature.feature.group 3.0.100.20190703-2009.
18:01:02 Installing ch.elexis.omnivore.feature.feature.group 3.2.100.20210602-1015.
18:01:02 Installing ch.elexis.privatrechnung.feature.feature.group 3.0.100.20210503-0656.
18:01:02 Installing ch.elexis.base.solr.feature.feature.group 1.0.0.20210421-1209.
18:01:02 Installing ch.elexis.stickynotes.feature.feature.group 3.0.100.20200924-1221.
18:01:02 Installing ch.elexis.support.dbshaker.feature.feature.group 3.0.100.20180309-1216.
18:01:02 Installing ch.gpb.elexis.cst.feature.feature.group 1.0.100.20200924-1221.
18:01:02 Installing ch.itmed.fop.printing.feature.feature.group 1.0.0.20210518-1340.
18:01:02 Installing ch.itmed.lmz.risch.laborder.feature.feature.group 3.7.0.20200901-1213.
18:01:02 Installing ch.medelexis.text.templator.feature.feature.group 3.0.100.20191115-1121.
18:01:02 Installing ch.medshare.connect.abacusjunior.feature.feature.group 3.0.100.20190411-1739.
18:01:02 Installing ch.medshare.elexis_directories.feature.feature.group 3.0.100.20180614-1456.
18:01:02 Installing ch.medshare.mediport.feature.feature.group 3.0.100.20201211-0824.
18:01:02 Installing ch.novcom.elexis.mednet.plugin.feature.feature.group 3.1.100.20201021-1138.
18:01:02 Installing ch.pharmed.phmprescriber.feature.feature.group 3.0.100.20200901-1213.
18:01:02 Installing ch.unibe.iam.scg.archie.feature.feature.group 3.0.100.20200831-1449.
18:01:02 Installing ch.weirich.templator.pages.feature.feature.group 3.0.100.20180309-1216.
18:01:02 Installing com.hilotec.elexis.kgview.feature.feature.group 3.0.100.20201002-0856.
18:01:02 Installing com.hilotec.elexis.messwerte.v2.feature.feature.group 3.0.100.20210406-1157.
18:01:02 Installing com.hilotec.elexis.opendocument.feature.feature.group 3.7.0.20190412-2013.
18:01:02 Installing at.medevit.medelexis.text.msword.feature.feature.group 3.8.0.20200611-1324.
18:01:02 Installing ch.medelexis.openoffice.feature.feature.group 3.8.0.20200611-1247.
18:01:02 Installing com.hilotec.elexis.opendocument2omnivore.feature.feature.group 3.0.100.20190430-1127.
18:01:02 Installing com.hilotec.elexis.pluginstatistiken.feature.feature.group 3.0.100.20201203-1126.
18:01:02 Installing com.hilotec.elexis.stickerprefix.feature.feature.group 3.0.100.20181207-1630.
18:01:02 Installing net.medshare.connector.aerztekasse.feature.feature.group 3.0.100.20201002-0856.
18:01:02 Installing net.medshare.connector.viollier.feature.feature.group 3.0.100.20201010-1213.
18:01:02 Installing org.iatrix.bestellung.rose.feature.feature.group 3.0.100.20210203-1734.
18:01:02 Installing org.iatrix.messwerte.feature.feature.group 3.0.100.20201118-1351.
18:01:02 Installing at.medbits.elexis.labbit.feature.feature.group 1.0.0.20200226-1024.
18:01:02 Installing org.eclipse.rcp.feature.group 4.15.0.v20200305-0155.
18:01:02 Installing org.eclipse.emf.common.feature.group 2.18.0.v20191225-1014.
18:01:02 Installing org.eclipse.emf.ecore.feature.group 2.21.0.v20200127-1342.
18:01:02 Installing org.eclipse.e4.rcp.feature.group 4.15.0.v20200304-0601.
18:01:02 Installing ch.elexis.core.application.feature.feature.group 3.9.0.20210604-0914.
18:01:02 Installing ch.elexis.core.common.feature.feature.group 3.9.0.20210604-1139.
18:01:02 Installing ch.elexis.core.logging.feature.feature.group 3.9.0.20210203-1259.
18:01:02 Installing ch.elexis.core.persistence.feature.feature.group 1.0.0.20210607-1153.
18:01:02 Installing ch.elexis.core.spotlight.feature.feature.group 1.0.0.20210421-1209.
18:01:02 Installing ch.elexis.core.tasks.feature.feature.group 1.0.0.20210507-1842.
18:01:02 Installing ch.elexis.core.ui.chromium.feature.feature.group 1.0.1.20210419-0340.
18:01:02 Installing ch.elexis.core.ui.eenv.feature.feature.group 1.0.0.20210406-1152.
18:01:02 Installing ch.elexis.core.ui.feature.feature.group 3.9.0.20210608-1106.
18:01:02 Installing ch.elexis.core.ui.p2.feature.feature.group 3.9.0.20200226-0838.
18:01:02 Installing ch.elexis.jre.feature.feature.group 3.9.0.20200728-1155.
18:01:30 Operation completed in 27540 ms.
18:01:30 [INFO] 
18:01:30 [INFO] --- tycho-p2-director-plugin:1.7.0:archive-products (archive-products) @ elexis-master ---
18:01:31 [INFO] Building zip: C:\Jenkins\build\workspace\elexis-uitest-windows\elexis-master\target\products\ElexisAllOpenSourceApp-win32.win32.x86_64.zip
18:01:39 [INFO] 
18:01:39 [INFO] -----------------------< ch.elexis.rcptt:setup >------------------------
18:01:39 [INFO] Building setup 0.1                                                 [2/4]
18:01:39 [INFO] --------------------------------[ pom ]---------------------------------
18:01:39 [INFO] 
18:01:39 [INFO] --- maven-clean-plugin:2.4.1:clean (default-clean) @ setup ---
18:01:39 [INFO] Deleting C:\tmp (includes = [elexis*db], excludes = [])
18:01:39 [INFO] Deleting C:\Users\vagrant\elexis (includes = [elexislock.*, localCfg*rcptt*xml, localCfg_default.xml], excludes = [])
18:01:39 [INFO] Deleting C:\Users\vagrant\elexis\rcptt (includes = [], excludes = [])
18:01:39 [INFO] 
18:01:39 [INFO] --- maven-scm-plugin:1.0:checkout (checkout) @ setup ---
18:01:39 [INFO] Removing C:\Users\vagrant\elexis\rcptt\elexis-vorlagen
18:01:39 [INFO] Executing: cmd.exe /X /C "git clone https://github.com/ngiger/elexis-vorlagen.git C:\Users\vagrant\elexis\rcptt\elexis-vorlagen"
18:01:39 [INFO] Working directory: C:\Users\vagrant\elexis\rcptt
18:01:39 [ERROR] Provider message:
18:01:39 [ERROR] The git-clone command failed.
18:01:39 [ERROR] Command output:
18:01:39 [ERROR] 'git' is not recognized as an internal or external command,
18:01:39 operable program or batch file.
18:01:39 
18:01:39 [INFO] ------------------------------------------------------------------------
18:01:39 [INFO] Reactor Summary:
18:01:39 [INFO] 
18:01:39 [INFO] elexis-master 3.9 .................................. SUCCESS [01:20 min]
18:01:39 [INFO] setup 0.1 .......................................... FAILURE [  0.541 s]
18:01:39 [INFO] KernFunktionen 0.1 ................................. SKIPPED
18:01:39 [INFO] h2 0.1 ............................................. SKIPPED
18:01:39 [INFO] ------------------------------------------------------------------------
18:01:39 [INFO] BUILD FAILURE
18:01:39 [INFO] ------------------------------------------------------------------------
18:01:39 [INFO] Total time:  01:30 min
18:01:39 [INFO] Finished at: 2021-06-08T16:01:41Z
18:01:39 [INFO] ------------------------------------------------------------------------
18:01:39 [ERROR] Failed to execute goal org.apache.maven.plugins:maven-scm-plugin:1.0:checkout (checkout) on project setup: Command failed.The git-clone command failed. -> [Help 1]
18:01:39 [ERROR] 
18:01:39 [ERROR] To see the full stack trace of the errors, re-run Maven with the -e switch.
18:01:39 [ERROR] Re-run Maven using the -X switch to enable full debug logging.
18:01:39 [ERROR] 
18:01:39 [ERROR] For more information about the errors and possible solutions, please read the following articles:
18:01:39 [ERROR] [Help 1] http://cwiki.apache.org/confluence/display/MAVEN/MojoExecutionException
18:01:39 [ERROR] 
18:01:39 [ERROR] After correcting the problems, you can resume the build with the command
18:01:39 [ERROR]   mvn <goals> -rf :setup
18:01:40 Build step 'Maven Goals aufrufen' marked build as failure
18:01:40 Archiviere Artefakte
18:01:40 Started calculate disk usage of build
18:01:40 Finished Calculation of disk usage of build in 0 seconds
18:01:40 Started calculate disk usage of workspace
18:01:41 Finished Calculation of disk usage of workspace in 0 seconds
18:01:41 Finished: FAILURE