Console Output

Skipping 613 KB.. Full Log
Downloading from rcptt-snapshots: https://repo.eclipse.org/content/repositories/rcptt-snapshots/org/codehaus/plexus/plexus-utils/3.0/plexus-utils-3.0.pom
17:52:11 Downloading from central: https://repo.maven.apache.org/maven2/org/codehaus/plexus/plexus-utils/3.0/plexus-utils-3.0.pom
17:52:11 Progress (1): 4.1 kB
                    
Downloaded from central: https://repo.maven.apache.org/maven2/org/codehaus/plexus/plexus-utils/3.0/plexus-utils-3.0.pom (4.1 kB at 75 kB/s)
17:52:11 Downloading from rcptt-releases: https://repo.eclipse.org/content/repositories/rcptt-releases/org/sonatype/spice/spice-parent/16/spice-parent-16.pom
17:52:11 Downloading from rcptt-snapshots: https://repo.eclipse.org/content/repositories/rcptt-snapshots/org/sonatype/spice/spice-parent/16/spice-parent-16.pom
17:52:12 Downloading from central: https://repo.maven.apache.org/maven2/org/sonatype/spice/spice-parent/16/spice-parent-16.pom
17:52:13 Progress (1): 4.1/8.4 kB
Progress (1): 8.2/8.4 kB
Progress (1): 8.4 kB    
                    
Downloaded from central: https://repo.maven.apache.org/maven2/org/sonatype/spice/spice-parent/16/spice-parent-16.pom (8.4 kB at 144 kB/s)
17:52:13 Downloading from rcptt-releases: https://repo.eclipse.org/content/repositories/rcptt-releases/org/apache/maven/maven-plugin-api/2.0.6/maven-plugin-api-2.0.6.jar
17:52:13 Downloading from rcptt-releases: https://repo.eclipse.org/content/repositories/rcptt-releases/org/codehaus/plexus/plexus-utils/3.0/plexus-utils-3.0.jar
17:52:13 Downloading from rcptt-snapshots: https://repo.eclipse.org/content/repositories/rcptt-snapshots/org/apache/maven/maven-plugin-api/2.0.6/maven-plugin-api-2.0.6.jar
17:52:13 Downloading from rcptt-snapshots: https://repo.eclipse.org/content/repositories/rcptt-snapshots/org/codehaus/plexus/plexus-utils/3.0/plexus-utils-3.0.jar
17:52:13 Downloading from central: https://repo.maven.apache.org/maven2/org/apache/maven/maven-plugin-api/2.0.6/maven-plugin-api-2.0.6.jar
17:52:14 Downloading from central: https://repo.maven.apache.org/maven2/org/codehaus/plexus/plexus-utils/3.0/plexus-utils-3.0.jar
17:52:14 Progress (1): 4.1/226 kB
Progress (1): 8.2/226 kB
Progress (1): 12/226 kB 
Progress (1): 16/226 kB
Progress (1): 20/226 kB
Progress (1): 25/226 kB
Progress (1): 29/226 kB
Progress (1): 33/226 kB
Progress (1): 37/226 kB
Progress (1): 41/226 kB
Progress (1): 45/226 kB
Progress (1): 49/226 kB
Progress (1): 53/226 kB
Progress (1): 57/226 kB
Progress (1): 61/226 kB
Progress (1): 66/226 kB
Progress (1): 70/226 kB
Progress (1): 74/226 kB
Progress (1): 78/226 kB
Progress (1): 82/226 kB
Progress (1): 86/226 kB
Progress (1): 90/226 kB
Progress (1): 94/226 kB
Progress (1): 98/226 kB
Progress (1): 102/226 kB
Progress (1): 106/226 kB
Progress (1): 111/226 kB
Progress (1): 115/226 kB
Progress (1): 119/226 kB
Progress (1): 123/226 kB
Progress (1): 127/226 kB
Progress (1): 131/226 kB
Progress (1): 135/226 kB
Progress (1): 139/226 kB
Progress (1): 143/226 kB
Progress (1): 147/226 kB
Progress (1): 152/226 kB
Progress (1): 156/226 kB
Progress (1): 160/226 kB
Progress (1): 164/226 kB
Progress (1): 168/226 kB
Progress (1): 172/226 kB
Progress (1): 176/226 kB
Progress (1): 180/226 kB
Progress (1): 184/226 kB
Progress (1): 188/226 kB
Progress (1): 193/226 kB
Progress (1): 197/226 kB
Progress (1): 201/226 kB
Progress (1): 205/226 kB
Progress (1): 209/226 kB
Progress (1): 213/226 kB
Progress (1): 217/226 kB
Progress (1): 221/226 kB
Progress (1): 225/226 kB
Progress (1): 226 kB    
Progress (2): 226 kB | 4.1/13 kB
Progress (2): 226 kB | 8.2/13 kB
Progress (2): 226 kB | 12/13 kB 
Progress (2): 226 kB | 13 kB   
                            
Downloaded from central: https://repo.maven.apache.org/maven2/org/codehaus/plexus/plexus-utils/3.0/plexus-utils-3.0.jar (226 kB at 2.9 MB/s)
17:52:14 Downloaded from central: https://repo.maven.apache.org/maven2/org/apache/maven/maven-plugin-api/2.0.6/maven-plugin-api-2.0.6.jar (13 kB at 126 kB/s)
17:52:14 [INFO] 
17:52:14 [INFO] --- tycho-packaging-plugin:1.7.0:build-qualifier-aggregator (default-build-qualifier-aggregator) @ elexis-master ---
17:52:14 [INFO] The project's OSGi version is 3.9.0
17:52:14 [INFO] 
17:52:14 [INFO] --- maven-clean-plugin:2.5:clean (default-clean-1) @ elexis-master ---
17:52:14 [INFO] 
17:52:14 [INFO] --- maven-resources-plugin:2.4.3:resources (default-resources) @ elexis-master ---
17:52:14 Downloading from rcptt-releases: https://repo.eclipse.org/content/repositories/rcptt-releases/org/apache/maven/maven-project/2.0.6/maven-project-2.0.6.pom
17:52:14 Downloading from rcptt-snapshots: https://repo.eclipse.org/content/repositories/rcptt-snapshots/org/apache/maven/maven-project/2.0.6/maven-project-2.0.6.pom
17:52:15 Downloading from central: https://repo.maven.apache.org/maven2/org/apache/maven/maven-project/2.0.6/maven-project-2.0.6.pom
17:52:15 Progress (1): 2.6 kB
                    
Downloaded from central: https://repo.maven.apache.org/maven2/org/apache/maven/maven-project/2.0.6/maven-project-2.0.6.pom (2.6 kB at 51 kB/s)
17:52:16 Downloading from rcptt-releases: https://repo.eclipse.org/content/repositories/rcptt-releases/org/apache/maven/maven-settings/2.0.6/maven-settings-2.0.6.pom
17:52:16 Downloading from rcptt-snapshots: https://repo.eclipse.org/content/repositories/rcptt-snapshots/org/apache/maven/maven-settings/2.0.6/maven-settings-2.0.6.pom
17:52:16 Downloading from central: https://repo.maven.apache.org/maven2/org/apache/maven/maven-settings/2.0.6/maven-settings-2.0.6.pom
17:52:17 Progress (1): 2.0 kB
                    
Downloaded from central: https://repo.maven.apache.org/maven2/org/apache/maven/maven-settings/2.0.6/maven-settings-2.0.6.pom (2.0 kB at 36 kB/s)
17:52:17 Downloading from rcptt-releases: https://repo.eclipse.org/content/repositories/rcptt-releases/org/apache/maven/maven-model/2.0.6/maven-model-2.0.6.pom
17:52:17 Downloading from rcptt-snapshots: https://repo.eclipse.org/content/repositories/rcptt-snapshots/org/apache/maven/maven-model/2.0.6/maven-model-2.0.6.pom
17:52:17 Downloading from central: https://repo.maven.apache.org/maven2/org/apache/maven/maven-model/2.0.6/maven-model-2.0.6.pom
17:52:18 Progress (1): 3.0 kB
                    
Downloaded from central: https://repo.maven.apache.org/maven2/org/apache/maven/maven-model/2.0.6/maven-model-2.0.6.pom (3.0 kB at 47 kB/s)
17:52:22 Downloading from rcptt-releases: https://repo.eclipse.org/content/repositories/rcptt-releases/org/codehaus/plexus/plexus-utils/1.4.1/plexus-utils-1.4.1.pom
17:52:22 Downloading from rcptt-snapshots: https://repo.eclipse.org/content/repositories/rcptt-snapshots/org/codehaus/plexus/plexus-utils/1.4.1/plexus-utils-1.4.1.pom
17:52:22 Downloading from central: https://repo.maven.apache.org/maven2/org/codehaus/plexus/plexus-utils/1.4.1/plexus-utils-1.4.1.pom
17:52:23 Progress (1): 1.9 kB
                    
Downloaded from central: https://repo.maven.apache.org/maven2/org/codehaus/plexus/plexus-utils/1.4.1/plexus-utils-1.4.1.pom (1.9 kB at 37 kB/s)
17:52:23 Downloading from rcptt-releases: https://repo.eclipse.org/content/repositories/rcptt-releases/org/apache/maven/maven-profile/2.0.6/maven-profile-2.0.6.pom
17:52:23 Downloading from rcptt-snapshots: https://repo.eclipse.org/content/repositories/rcptt-snapshots/org/apache/maven/maven-profile/2.0.6/maven-profile-2.0.6.pom
17:52:24 Downloading from central: https://repo.maven.apache.org/maven2/org/apache/maven/maven-profile/2.0.6/maven-profile-2.0.6.pom
17:52:24 Progress (1): 2.0 kB
                    
Downloaded from central: https://repo.maven.apache.org/maven2/org/apache/maven/maven-profile/2.0.6/maven-profile-2.0.6.pom (2.0 kB at 35 kB/s)
17:52:24 Downloading from rcptt-releases: https://repo.eclipse.org/content/repositories/rcptt-releases/org/apache/maven/maven-artifact-manager/2.0.6/maven-artifact-manager-2.0.6.pom
17:52:24 Downloading from rcptt-snapshots: https://repo.eclipse.org/content/repositories/rcptt-snapshots/org/apache/maven/maven-artifact-manager/2.0.6/maven-artifact-manager-2.0.6.pom
17:52:25 Downloading from central: https://repo.maven.apache.org/maven2/org/apache/maven/maven-artifact-manager/2.0.6/maven-artifact-manager-2.0.6.pom
17:52:26 Progress (1): 2.6 kB
                    
Downloaded from central: https://repo.maven.apache.org/maven2/org/apache/maven/maven-artifact-manager/2.0.6/maven-artifact-manager-2.0.6.pom (2.6 kB at 45 kB/s)
17:52:26 Downloading from rcptt-releases: https://repo.eclipse.org/content/repositories/rcptt-releases/org/apache/maven/maven-repository-metadata/2.0.6/maven-repository-metadata-2.0.6.pom
17:52:26 Downloading from rcptt-snapshots: https://repo.eclipse.org/content/repositories/rcptt-snapshots/org/apache/maven/maven-repository-metadata/2.0.6/maven-repository-metadata-2.0.6.pom
17:52:26 Downloading from central: https://repo.maven.apache.org/maven2/org/apache/maven/maven-repository-metadata/2.0.6/maven-repository-metadata-2.0.6.pom
17:52:27 Progress (1): 1.9 kB
                    
Downloaded from central: https://repo.maven.apache.org/maven2/org/apache/maven/maven-repository-metadata/2.0.6/maven-repository-metadata-2.0.6.pom (1.9 kB at 36 kB/s)
17:52:27 Downloading from rcptt-releases: https://repo.eclipse.org/content/repositories/rcptt-releases/org/apache/maven/maven-artifact/2.0.6/maven-artifact-2.0.6.pom
17:52:27 Downloading from rcptt-snapshots: https://repo.eclipse.org/content/repositories/rcptt-snapshots/org/apache/maven/maven-artifact/2.0.6/maven-artifact-2.0.6.pom
17:52:27 Downloading from central: https://repo.maven.apache.org/maven2/org/apache/maven/maven-artifact/2.0.6/maven-artifact-2.0.6.pom
17:52:28 Progress (1): 1.6 kB
                    
Downloaded from central: https://repo.maven.apache.org/maven2/org/apache/maven/maven-artifact/2.0.6/maven-artifact-2.0.6.pom (1.6 kB at 30 kB/s)
17:52:28 Downloading from rcptt-releases: https://repo.eclipse.org/content/repositories/rcptt-releases/org/apache/maven/maven-plugin-registry/2.0.6/maven-plugin-registry-2.0.6.pom
17:52:28 Downloading from rcptt-snapshots: https://repo.eclipse.org/content/repositories/rcptt-snapshots/org/apache/maven/maven-plugin-registry/2.0.6/maven-plugin-registry-2.0.6.pom
17:52:29 Downloading from central: https://repo.maven.apache.org/maven2/org/apache/maven/maven-plugin-registry/2.0.6/maven-plugin-registry-2.0.6.pom
17:52:29 Progress (1): 1.9 kB
                    
Downloaded from central: https://repo.maven.apache.org/maven2/org/apache/maven/maven-plugin-registry/2.0.6/maven-plugin-registry-2.0.6.pom (1.9 kB at 37 kB/s)
17:52:29 Downloading from rcptt-releases: https://repo.eclipse.org/content/repositories/rcptt-releases/org/apache/maven/maven-core/2.0.6/maven-core-2.0.6.pom
17:52:29 Downloading from rcptt-snapshots: https://repo.eclipse.org/content/repositories/rcptt-snapshots/org/apache/maven/maven-core/2.0.6/maven-core-2.0.6.pom
17:52:30 Downloading from central: https://repo.maven.apache.org/maven2/org/apache/maven/maven-core/2.0.6/maven-core-2.0.6.pom
17:52:31 Progress (1): 4.1/6.7 kB
Progress (1): 6.7 kB    
                    
Downloaded from central: https://repo.maven.apache.org/maven2/org/apache/maven/maven-core/2.0.6/maven-core-2.0.6.pom (6.7 kB at 103 kB/s)
17:52:31 Downloading from rcptt-releases: https://repo.eclipse.org/content/repositories/rcptt-releases/org/apache/maven/maven-plugin-parameter-documenter/2.0.6/maven-plugin-parameter-documenter-2.0.6.pom
17:52:31 Downloading from rcptt-snapshots: https://repo.eclipse.org/content/repositories/rcptt-snapshots/org/apache/maven/maven-plugin-parameter-documenter/2.0.6/maven-plugin-parameter-documenter-2.0.6.pom
17:52:31 Downloading from central: https://repo.maven.apache.org/maven2/org/apache/maven/maven-plugin-parameter-documenter/2.0.6/maven-plugin-parameter-documenter-2.0.6.pom
17:52:32 Progress (1): 1.9 kB
                    
Downloaded from central: https://repo.maven.apache.org/maven2/org/apache/maven/maven-plugin-parameter-documenter/2.0.6/maven-plugin-parameter-documenter-2.0.6.pom (1.9 kB at 37 kB/s)
17:52:32 Downloading from rcptt-releases: https://repo.eclipse.org/content/repositories/rcptt-releases/org/apache/maven/reporting/maven-reporting-api/2.0.6/maven-reporting-api-2.0.6.pom
17:52:32 Downloading from rcptt-snapshots: https://repo.eclipse.org/content/repositories/rcptt-snapshots/org/apache/maven/reporting/maven-reporting-api/2.0.6/maven-reporting-api-2.0.6.pom
17:52:33 Downloading from central: https://repo.maven.apache.org/maven2/org/apache/maven/reporting/maven-reporting-api/2.0.6/maven-reporting-api-2.0.6.pom
17:52:33 Progress (1): 1.8 kB
                    
Downloaded from central: https://repo.maven.apache.org/maven2/org/apache/maven/reporting/maven-reporting-api/2.0.6/maven-reporting-api-2.0.6.pom (1.8 kB at 39 kB/s)
17:52:33 Downloading from rcptt-releases: https://repo.eclipse.org/content/repositories/rcptt-releases/org/apache/maven/reporting/maven-reporting/2.0.6/maven-reporting-2.0.6.pom
17:52:33 Downloading from rcptt-snapshots: https://repo.eclipse.org/content/repositories/rcptt-snapshots/org/apache/maven/reporting/maven-reporting/2.0.6/maven-reporting-2.0.6.pom
17:52:34 Downloading from central: https://repo.maven.apache.org/maven2/org/apache/maven/reporting/maven-reporting/2.0.6/maven-reporting-2.0.6.pom
17:52:35 Progress (1): 1.4 kB
                    
Downloaded from central: https://repo.maven.apache.org/maven2/org/apache/maven/reporting/maven-reporting/2.0.6/maven-reporting-2.0.6.pom (1.4 kB at 28 kB/s)
17:52:35 Downloading from rcptt-releases: https://repo.eclipse.org/content/repositories/rcptt-releases/org/apache/maven/doxia/doxia-sink-api/1.0-alpha-7/doxia-sink-api-1.0-alpha-7.pom
17:52:35 Downloading from rcptt-snapshots: https://repo.eclipse.org/content/repositories/rcptt-snapshots/org/apache/maven/doxia/doxia-sink-api/1.0-alpha-7/doxia-sink-api-1.0-alpha-7.pom
17:52:35 Downloading from central: https://repo.maven.apache.org/maven2/org/apache/maven/doxia/doxia-sink-api/1.0-alpha-7/doxia-sink-api-1.0-alpha-7.pom
17:52:36 Progress (1): 424 B
                   
Downloaded from central: https://repo.maven.apache.org/maven2/org/apache/maven/doxia/doxia-sink-api/1.0-alpha-7/doxia-sink-api-1.0-alpha-7.pom (424 B at 8.7 kB/s)
17:52:36 Downloading from rcptt-releases: https://repo.eclipse.org/content/repositories/rcptt-releases/org/apache/maven/doxia/doxia/1.0-alpha-7/doxia-1.0-alpha-7.pom
17:52:36 Downloading from rcptt-snapshots: https://repo.eclipse.org/content/repositories/rcptt-snapshots/org/apache/maven/doxia/doxia/1.0-alpha-7/doxia-1.0-alpha-7.pom
17:52:36 Downloading from central: https://repo.maven.apache.org/maven2/org/apache/maven/doxia/doxia/1.0-alpha-7/doxia-1.0-alpha-7.pom
17:52:37 Progress (1): 3.9 kB
                    
Downloaded from central: https://repo.maven.apache.org/maven2/org/apache/maven/doxia/doxia/1.0-alpha-7/doxia-1.0-alpha-7.pom (3.9 kB at 77 kB/s)
17:52:37 Downloading from rcptt-releases: https://repo.eclipse.org/content/repositories/rcptt-releases/org/apache/maven/maven-error-diagnostics/2.0.6/maven-error-diagnostics-2.0.6.pom
17:52:37 Downloading from rcptt-snapshots: https://repo.eclipse.org/content/repositories/rcptt-snapshots/org/apache/maven/maven-error-diagnostics/2.0.6/maven-error-diagnostics-2.0.6.pom
17:52:38 Downloading from central: https://repo.maven.apache.org/maven2/org/apache/maven/maven-error-diagnostics/2.0.6/maven-error-diagnostics-2.0.6.pom
17:52:38 Progress (1): 1.7 kB
                    
Downloaded from central: https://repo.maven.apache.org/maven2/org/apache/maven/maven-error-diagnostics/2.0.6/maven-error-diagnostics-2.0.6.pom (1.7 kB at 35 kB/s)
17:52:38 Downloading from rcptt-releases: https://repo.eclipse.org/content/repositories/rcptt-releases/commons-cli/commons-cli/1.0/commons-cli-1.0.pom
17:52:38 Downloading from rcptt-snapshots: https://repo.eclipse.org/content/repositories/rcptt-snapshots/commons-cli/commons-cli/1.0/commons-cli-1.0.pom
17:52:39 Downloading from central: https://repo.maven.apache.org/maven2/commons-cli/commons-cli/1.0/commons-cli-1.0.pom
17:52:40 Progress (1): 2.1 kB
                    
Downloaded from central: https://repo.maven.apache.org/maven2/commons-cli/commons-cli/1.0/commons-cli-1.0.pom (2.1 kB at 45 kB/s)
17:52:40 Downloading from rcptt-releases: https://repo.eclipse.org/content/repositories/rcptt-releases/org/apache/maven/maven-plugin-descriptor/2.0.6/maven-plugin-descriptor-2.0.6.pom
17:52:40 Downloading from rcptt-snapshots: https://repo.eclipse.org/content/repositories/rcptt-snapshots/org/apache/maven/maven-plugin-descriptor/2.0.6/maven-plugin-descriptor-2.0.6.pom
17:52:40 Downloading from central: https://repo.maven.apache.org/maven2/org/apache/maven/maven-plugin-descriptor/2.0.6/maven-plugin-descriptor-2.0.6.pom
17:52:41 Progress (1): 2.0 kB
                    
Downloaded from central: https://repo.maven.apache.org/maven2/org/apache/maven/maven-plugin-descriptor/2.0.6/maven-plugin-descriptor-2.0.6.pom (2.0 kB at 34 kB/s)
17:52:41 Downloading from rcptt-releases: https://repo.eclipse.org/content/repositories/rcptt-releases/org/codehaus/plexus/plexus-interactivity-api/1.0-alpha-4/plexus-interactivity-api-1.0-alpha-4.pom
17:52:41 Downloading from rcptt-snapshots: https://repo.eclipse.org/content/repositories/rcptt-snapshots/org/codehaus/plexus/plexus-interactivity-api/1.0-alpha-4/plexus-interactivity-api-1.0-alpha-4.pom
17:52:42 Downloading from central: https://repo.maven.apache.org/maven2/org/codehaus/plexus/plexus-interactivity-api/1.0-alpha-4/plexus-interactivity-api-1.0-alpha-4.pom
17:52:42 Progress (1): 4.1/7.1 kB
Progress (1): 7.1 kB    
                    
Downloaded from central: https://repo.maven.apache.org/maven2/org/codehaus/plexus/plexus-interactivity-api/1.0-alpha-4/plexus-interactivity-api-1.0-alpha-4.pom (7.1 kB at 136 kB/s)
17:52:42 Downloading from rcptt-releases: https://repo.eclipse.org/content/repositories/rcptt-releases/org/apache/maven/maven-monitor/2.0.6/maven-monitor-2.0.6.pom
17:52:42 Downloading from rcptt-snapshots: https://repo.eclipse.org/content/repositories/rcptt-snapshots/org/apache/maven/maven-monitor/2.0.6/maven-monitor-2.0.6.pom
17:52:43 Downloading from central: https://repo.maven.apache.org/maven2/org/apache/maven/maven-monitor/2.0.6/maven-monitor-2.0.6.pom
17:52:44 Progress (1): 1.3 kB
                    
Downloaded from central: https://repo.maven.apache.org/maven2/org/apache/maven/maven-monitor/2.0.6/maven-monitor-2.0.6.pom (1.3 kB at 20 kB/s)
17:52:44 Downloading from rcptt-releases: https://repo.eclipse.org/content/repositories/rcptt-releases/classworlds/classworlds/1.1/classworlds-1.1.pom
17:52:44 Downloading from rcptt-snapshots: https://repo.eclipse.org/content/repositories/rcptt-snapshots/classworlds/classworlds/1.1/classworlds-1.1.pom
17:52:44 Downloading from central: https://repo.maven.apache.org/maven2/classworlds/classworlds/1.1/classworlds-1.1.pom
17:52:45 Progress (1): 3.3 kB
                    
Downloaded from central: https://repo.maven.apache.org/maven2/classworlds/classworlds/1.1/classworlds-1.1.pom (3.3 kB at 68 kB/s)
17:52:45 Downloading from rcptt-releases: https://repo.eclipse.org/content/repositories/rcptt-releases/org/apache/maven/shared/maven-filtering/1.0-beta-4/maven-filtering-1.0-beta-4.pom
17:52:45 Downloading from rcptt-snapshots: https://repo.eclipse.org/content/repositories/rcptt-snapshots/org/apache/maven/shared/maven-filtering/1.0-beta-4/maven-filtering-1.0-beta-4.pom
17:52:45 Downloading from central: https://repo.maven.apache.org/maven2/org/apache/maven/shared/maven-filtering/1.0-beta-4/maven-filtering-1.0-beta-4.pom
17:52:46 Progress (1): 4.1/4.7 kB
Progress (1): 4.7 kB    
                    
Downloaded from central: https://repo.maven.apache.org/maven2/org/apache/maven/shared/maven-filtering/1.0-beta-4/maven-filtering-1.0-beta-4.pom (4.7 kB at 82 kB/s)
17:52:46 Downloading from rcptt-releases: https://repo.eclipse.org/content/repositories/rcptt-releases/org/apache/maven/shared/maven-shared-components/15/maven-shared-components-15.pom
17:52:46 Downloading from rcptt-snapshots: https://repo.eclipse.org/content/repositories/rcptt-snapshots/org/apache/maven/shared/maven-shared-components/15/maven-shared-components-15.pom
17:52:47 Downloading from central: https://repo.maven.apache.org/maven2/org/apache/maven/shared/maven-shared-components/15/maven-shared-components-15.pom
17:52:47 Progress (1): 4.1/9.3 kB
Progress (1): 8.2/9.3 kB
Progress (1): 9.3 kB    
                    
Downloaded from central: https://repo.maven.apache.org/maven2/org/apache/maven/shared/maven-shared-components/15/maven-shared-components-15.pom (9.3 kB at 180 kB/s)
17:52:47 Downloading from rcptt-releases: https://repo.eclipse.org/content/repositories/rcptt-releases/org/codehaus/plexus/plexus-utils/1.5.15/plexus-utils-1.5.15.pom
17:52:47 Downloading from rcptt-snapshots: https://repo.eclipse.org/content/repositories/rcptt-snapshots/org/codehaus/plexus/plexus-utils/1.5.15/plexus-utils-1.5.15.pom
17:52:48 Downloading from central: https://repo.maven.apache.org/maven2/org/codehaus/plexus/plexus-utils/1.5.15/plexus-utils-1.5.15.pom
17:52:49 Progress (1): 4.1/6.8 kB
Progress (1): 6.8 kB    
                    
Downloaded from central: https://repo.maven.apache.org/maven2/org/codehaus/plexus/plexus-utils/1.5.15/plexus-utils-1.5.15.pom (6.8 kB at 99 kB/s)
17:52:49 Downloading from rcptt-releases: https://repo.eclipse.org/content/repositories/rcptt-releases/org/codehaus/plexus/plexus/2.0.2/plexus-2.0.2.pom
17:52:49 Downloading from rcptt-snapshots: https://repo.eclipse.org/content/repositories/rcptt-snapshots/org/codehaus/plexus/plexus/2.0.2/plexus-2.0.2.pom
17:52:49 Downloading from central: https://repo.maven.apache.org/maven2/org/codehaus/plexus/plexus/2.0.2/plexus-2.0.2.pom
17:52:50 Progress (1): 4.1/12 kB
Progress (1): 8.2/12 kB
Progress (1): 12 kB    
                   
Downloaded from central: https://repo.maven.apache.org/maven2/org/codehaus/plexus/plexus/2.0.2/plexus-2.0.2.pom (12 kB at 228 kB/s)
17:52:50 Downloading from rcptt-releases: https://repo.eclipse.org/content/repositories/rcptt-releases/org/codehaus/plexus/plexus-interpolation/1.12/plexus-interpolation-1.12.pom
17:52:50 Downloading from rcptt-snapshots: https://repo.eclipse.org/content/repositories/rcptt-snapshots/org/codehaus/plexus/plexus-interpolation/1.12/plexus-interpolation-1.12.pom
17:52:51 Downloading from central: https://repo.maven.apache.org/maven2/org/codehaus/plexus/plexus-interpolation/1.12/plexus-interpolation-1.12.pom
17:52:51 Progress (1): 889 B
                   
Downloaded from central: https://repo.maven.apache.org/maven2/org/codehaus/plexus/plexus-interpolation/1.12/plexus-interpolation-1.12.pom (889 B at 18 kB/s)
17:52:51 Downloading from rcptt-releases: https://repo.eclipse.org/content/repositories/rcptt-releases/org/codehaus/plexus/plexus-components/1.1.14/plexus-components-1.1.14.pom
17:52:51 Downloading from rcptt-snapshots: https://repo.eclipse.org/content/repositories/rcptt-snapshots/org/codehaus/plexus/plexus-components/1.1.14/plexus-components-1.1.14.pom
17:52:52 Downloading from central: https://repo.maven.apache.org/maven2/org/codehaus/plexus/plexus-components/1.1.14/plexus-components-1.1.14.pom
17:52:53 Progress (1): 4.1/5.8 kB
Progress (1): 5.8 kB    
                    
Downloaded from central: https://repo.maven.apache.org/maven2/org/codehaus/plexus/plexus-components/1.1.14/plexus-components-1.1.14.pom (5.8 kB at 102 kB/s)
17:52:53 Downloading from rcptt-releases: https://repo.eclipse.org/content/repositories/rcptt-releases/org/sonatype/plexus/plexus-build-api/0.0.4/plexus-build-api-0.0.4.pom
17:52:53 Downloading from rcptt-snapshots: https://repo.eclipse.org/content/repositories/rcptt-snapshots/org/sonatype/plexus/plexus-build-api/0.0.4/plexus-build-api-0.0.4.pom
17:52:53 Downloading from central: https://repo.maven.apache.org/maven2/org/sonatype/plexus/plexus-build-api/0.0.4/plexus-build-api-0.0.4.pom
17:52:54 Progress (1): 2.9 kB
                    
Downloaded from central: https://repo.maven.apache.org/maven2/org/sonatype/plexus/plexus-build-api/0.0.4/plexus-build-api-0.0.4.pom (2.9 kB at 55 kB/s)
17:52:54 Downloading from rcptt-releases: https://repo.eclipse.org/content/repositories/rcptt-releases/org/sonatype/spice/spice-parent/10/spice-parent-10.pom
17:52:58 Downloading from rcptt-snapshots: https://repo.eclipse.org/content/repositories/rcptt-snapshots/org/sonatype/spice/spice-parent/10/spice-parent-10.pom
17:52:58 Downloading from central: https://repo.maven.apache.org/maven2/org/sonatype/spice/spice-parent/10/spice-parent-10.pom
17:52:59 Progress (1): 3.0 kB
                    
Downloaded from central: https://repo.maven.apache.org/maven2/org/sonatype/spice/spice-parent/10/spice-parent-10.pom (3.0 kB at 55 kB/s)
17:52:59 Downloading from rcptt-releases: https://repo.eclipse.org/content/repositories/rcptt-releases/org/sonatype/forge/forge-parent/3/forge-parent-3.pom
17:52:59 Downloading from rcptt-snapshots: https://repo.eclipse.org/content/repositories/rcptt-snapshots/org/sonatype/forge/forge-parent/3/forge-parent-3.pom
17:52:59 Downloading from central: https://repo.maven.apache.org/maven2/org/sonatype/forge/forge-parent/3/forge-parent-3.pom
17:53:00 Progress (1): 4.1/5.0 kB
Progress (1): 5.0 kB    
                    
Downloaded from central: https://repo.maven.apache.org/maven2/org/sonatype/forge/forge-parent/3/forge-parent-3.pom (5.0 kB at 79 kB/s)
17:53:00 Downloading from rcptt-releases: https://repo.eclipse.org/content/repositories/rcptt-releases/org/codehaus/plexus/plexus-utils/1.5.8/plexus-utils-1.5.8.pom
17:53:00 Downloading from rcptt-snapshots: https://repo.eclipse.org/content/repositories/rcptt-snapshots/org/codehaus/plexus/plexus-utils/1.5.8/plexus-utils-1.5.8.pom
17:53:01 Downloading from central: https://repo.maven.apache.org/maven2/org/codehaus/plexus/plexus-utils/1.5.8/plexus-utils-1.5.8.pom
17:53:01 Progress (1): 4.1/8.1 kB
Progress (1): 8.1 kB    
                    
Downloaded from central: https://repo.maven.apache.org/maven2/org/codehaus/plexus/plexus-utils/1.5.8/plexus-utils-1.5.8.pom (8.1 kB at 126 kB/s)
17:53:01 Downloading from rcptt-releases: https://repo.eclipse.org/content/repositories/rcptt-releases/org/codehaus/plexus/plexus-interpolation/1.13/plexus-interpolation-1.13.pom
17:53:01 Downloading from rcptt-snapshots: https://repo.eclipse.org/content/repositories/rcptt-snapshots/org/codehaus/plexus/plexus-interpolation/1.13/plexus-interpolation-1.13.pom
17:53:02 Downloading from central: https://repo.maven.apache.org/maven2/org/codehaus/plexus/plexus-interpolation/1.13/plexus-interpolation-1.13.pom
17:53:03 Progress (1): 890 B
                   
Downloaded from central: https://repo.maven.apache.org/maven2/org/codehaus/plexus/plexus-interpolation/1.13/plexus-interpolation-1.13.pom (890 B at 17 kB/s)
17:53:03 Downloading from rcptt-releases: https://repo.eclipse.org/content/repositories/rcptt-releases/org/codehaus/plexus/plexus-components/1.1.15/plexus-components-1.1.15.pom
17:53:03 Downloading from rcptt-snapshots: https://repo.eclipse.org/content/repositories/rcptt-snapshots/org/codehaus/plexus/plexus-components/1.1.15/plexus-components-1.1.15.pom
17:53:03 Downloading from central: https://repo.maven.apache.org/maven2/org/codehaus/plexus/plexus-components/1.1.15/plexus-components-1.1.15.pom
17:53:04 Progress (1): 2.8 kB
                    
Downloaded from central: https://repo.maven.apache.org/maven2/org/codehaus/plexus/plexus-components/1.1.15/plexus-components-1.1.15.pom (2.8 kB at 47 kB/s)
17:53:04 Downloading from rcptt-releases: https://repo.eclipse.org/content/repositories/rcptt-releases/org/codehaus/plexus/plexus/2.0.3/plexus-2.0.3.pom
17:53:04 Downloading from rcptt-snapshots: https://repo.eclipse.org/content/repositories/rcptt-snapshots/org/codehaus/plexus/plexus/2.0.3/plexus-2.0.3.pom
17:53:05 Downloading from central: https://repo.maven.apache.org/maven2/org/codehaus/plexus/plexus/2.0.3/plexus-2.0.3.pom
17:53:05 Progress (1): 4.1/15 kB
Progress (1): 8.2/15 kB
Progress (1): 12/15 kB 
Progress (1): 15 kB   
                   
Downloaded from central: https://repo.maven.apache.org/maven2/org/codehaus/plexus/plexus/2.0.3/plexus-2.0.3.pom (15 kB at 249 kB/s)
17:53:05 Downloading from rcptt-releases: https://repo.eclipse.org/content/repositories/rcptt-releases/org/apache/maven/maven-project/2.0.6/maven-project-2.0.6.jar
17:53:05 Downloading from rcptt-releases: https://repo.eclipse.org/content/repositories/rcptt-releases/org/apache/maven/maven-core/2.0.6/maven-core-2.0.6.jar
17:53:05 Downloading from rcptt-releases: https://repo.eclipse.org/content/repositories/rcptt-releases/org/apache/maven/maven-artifact-manager/2.0.6/maven-artifact-manager-2.0.6.jar
17:53:05 Downloading from rcptt-releases: https://repo.eclipse.org/content/repositories/rcptt-releases/org/apache/maven/maven-plugin-registry/2.0.6/maven-plugin-registry-2.0.6.jar
17:53:05 Downloading from rcptt-releases: https://repo.eclipse.org/content/repositories/rcptt-releases/org/apache/maven/maven-profile/2.0.6/maven-profile-2.0.6.jar
17:53:05 Downloading from rcptt-releases: https://repo.eclipse.org/content/repositories/rcptt-releases/org/apache/maven/maven-plugin-parameter-documenter/2.0.6/maven-plugin-parameter-documenter-2.0.6.jar
17:53:06 Downloading from rcptt-releases: https://repo.eclipse.org/content/repositories/rcptt-releases/org/apache/maven/reporting/maven-reporting-api/2.0.6/maven-reporting-api-2.0.6.jar
17:53:06 Downloading from rcptt-releases: https://repo.eclipse.org/content/repositories/rcptt-releases/org/apache/maven/doxia/doxia-sink-api/1.0-alpha-7/doxia-sink-api-1.0-alpha-7.jar
17:53:06 Downloading from rcptt-releases: https://repo.eclipse.org/content/repositories/rcptt-releases/org/apache/maven/maven-repository-metadata/2.0.6/maven-repository-metadata-2.0.6.jar
17:53:06 Downloading from rcptt-releases: https://repo.eclipse.org/content/repositories/rcptt-releases/org/apache/maven/maven-error-diagnostics/2.0.6/maven-error-diagnostics-2.0.6.jar
17:53:06 Downloading from rcptt-releases: https://repo.eclipse.org/content/repositories/rcptt-releases/commons-cli/commons-cli/1.0/commons-cli-1.0.jar
17:53:07 Downloading from rcptt-releases: https://repo.eclipse.org/content/repositories/rcptt-releases/org/apache/maven/maven-plugin-descriptor/2.0.6/maven-plugin-descriptor-2.0.6.jar
17:53:07 Downloading from rcptt-releases: https://repo.eclipse.org/content/repositories/rcptt-releases/org/codehaus/plexus/plexus-interactivity-api/1.0-alpha-4/plexus-interactivity-api-1.0-alpha-4.jar
17:53:07 Downloading from rcptt-releases: https://repo.eclipse.org/content/repositories/rcptt-releases/classworlds/classworlds/1.1/classworlds-1.1.jar
17:53:07 Downloading from rcptt-releases: https://repo.eclipse.org/content/repositories/rcptt-releases/org/apache/maven/maven-artifact/2.0.6/maven-artifact-2.0.6.jar
17:53:07 Downloading from rcptt-releases: https://repo.eclipse.org/content/repositories/rcptt-releases/org/apache/maven/maven-settings/2.0.6/maven-settings-2.0.6.jar
17:53:07 Downloading from rcptt-releases: https://repo.eclipse.org/content/repositories/rcptt-releases/org/apache/maven/maven-model/2.0.6/maven-model-2.0.6.jar
17:53:07 Downloading from rcptt-releases: https://repo.eclipse.org/content/repositories/rcptt-releases/org/apache/maven/maven-monitor/2.0.6/maven-monitor-2.0.6.jar
17:53:07 Downloading from rcptt-releases: https://repo.eclipse.org/content/repositories/rcptt-releases/org/apache/maven/shared/maven-filtering/1.0-beta-4/maven-filtering-1.0-beta-4.jar
17:53:07 Downloading from rcptt-releases: https://repo.eclipse.org/content/repositories/rcptt-releases/org/sonatype/plexus/plexus-build-api/0.0.4/plexus-build-api-0.0.4.jar
17:53:07 Downloading from rcptt-releases: https://repo.eclipse.org/content/repositories/rcptt-releases/org/codehaus/plexus/plexus-interpolation/1.13/plexus-interpolation-1.13.jar
17:53:08 Downloading from rcptt-snapshots: https://repo.eclipse.org/content/repositories/rcptt-snapshots/org/apache/maven/maven-project/2.0.6/maven-project-2.0.6.jar
17:53:08 Downloading from rcptt-snapshots: https://repo.eclipse.org/content/repositories/rcptt-snapshots/org/apache/maven/maven-core/2.0.6/maven-core-2.0.6.jar
17:53:08 Downloading from rcptt-snapshots: https://repo.eclipse.org/content/repositories/rcptt-snapshots/org/apache/maven/maven-artifact-manager/2.0.6/maven-artifact-manager-2.0.6.jar
17:53:09 Downloading from rcptt-snapshots: https://repo.eclipse.org/content/repositories/rcptt-snapshots/org/apache/maven/maven-plugin-registry/2.0.6/maven-plugin-registry-2.0.6.jar
17:53:09 Downloading from rcptt-snapshots: https://repo.eclipse.org/content/repositories/rcptt-snapshots/org/apache/maven/maven-profile/2.0.6/maven-profile-2.0.6.jar
17:53:09 Downloading from rcptt-snapshots: https://repo.eclipse.org/content/repositories/rcptt-snapshots/org/apache/maven/maven-plugin-parameter-documenter/2.0.6/maven-plugin-parameter-documenter-2.0.6.jar
17:53:09 Downloading from rcptt-snapshots: https://repo.eclipse.org/content/repositories/rcptt-snapshots/org/apache/maven/reporting/maven-reporting-api/2.0.6/maven-reporting-api-2.0.6.jar
17:53:09 Downloading from rcptt-snapshots: https://repo.eclipse.org/content/repositories/rcptt-snapshots/org/apache/maven/doxia/doxia-sink-api/1.0-alpha-7/doxia-sink-api-1.0-alpha-7.jar
17:53:09 Downloading from rcptt-snapshots: https://repo.eclipse.org/content/repositories/rcptt-snapshots/org/apache/maven/maven-repository-metadata/2.0.6/maven-repository-metadata-2.0.6.jar
17:53:09 Downloading from rcptt-snapshots: https://repo.eclipse.org/content/repositories/rcptt-snapshots/org/apache/maven/maven-error-diagnostics/2.0.6/maven-error-diagnostics-2.0.6.jar
17:53:09 Downloading from rcptt-snapshots: https://repo.eclipse.org/content/repositories/rcptt-snapshots/commons-cli/commons-cli/1.0/commons-cli-1.0.jar
17:53:10 Downloading from rcptt-snapshots: https://repo.eclipse.org/content/repositories/rcptt-snapshots/org/apache/maven/maven-plugin-descriptor/2.0.6/maven-plugin-descriptor-2.0.6.jar
17:53:10 Downloading from rcptt-snapshots: https://repo.eclipse.org/content/repositories/rcptt-snapshots/org/codehaus/plexus/plexus-interactivity-api/1.0-alpha-4/plexus-interactivity-api-1.0-alpha-4.jar
17:53:10 Downloading from rcptt-snapshots: https://repo.eclipse.org/content/repositories/rcptt-snapshots/classworlds/classworlds/1.1/classworlds-1.1.jar
17:53:10 Downloading from rcptt-snapshots: https://repo.eclipse.org/content/repositories/rcptt-snapshots/org/apache/maven/maven-artifact/2.0.6/maven-artifact-2.0.6.jar
17:53:10 Downloading from rcptt-snapshots: https://repo.eclipse.org/content/repositories/rcptt-snapshots/org/apache/maven/maven-settings/2.0.6/maven-settings-2.0.6.jar
17:53:10 Downloading from rcptt-snapshots: https://repo.eclipse.org/content/repositories/rcptt-snapshots/org/apache/maven/maven-model/2.0.6/maven-model-2.0.6.jar
17:53:10 Downloading from rcptt-snapshots: https://repo.eclipse.org/content/repositories/rcptt-snapshots/org/apache/maven/maven-monitor/2.0.6/maven-monitor-2.0.6.jar
17:53:10 Downloading from rcptt-snapshots: https://repo.eclipse.org/content/repositories/rcptt-snapshots/org/apache/maven/shared/maven-filtering/1.0-beta-4/maven-filtering-1.0-beta-4.jar
17:53:10 Downloading from rcptt-snapshots: https://repo.eclipse.org/content/repositories/rcptt-snapshots/org/sonatype/plexus/plexus-build-api/0.0.4/plexus-build-api-0.0.4.jar
17:53:10 Downloading from rcptt-snapshots: https://repo.eclipse.org/content/repositories/rcptt-snapshots/org/codehaus/plexus/plexus-interpolation/1.13/plexus-interpolation-1.13.jar
17:53:11 Downloading from central: https://repo.maven.apache.org/maven2/org/apache/maven/maven-project/2.0.6/maven-project-2.0.6.jar
17:53:12 Downloading from central: https://repo.maven.apache.org/maven2/org/apache/maven/maven-core/2.0.6/maven-core-2.0.6.jar
17:53:12 Downloading from central: https://repo.maven.apache.org/maven2/org/apache/maven/maven-artifact-manager/2.0.6/maven-artifact-manager-2.0.6.jar
17:53:12 Downloading from central: https://repo.maven.apache.org/maven2/org/apache/maven/maven-plugin-registry/2.0.6/maven-plugin-registry-2.0.6.jar
17:53:12 Downloading from central: https://repo.maven.apache.org/maven2/org/apache/maven/maven-profile/2.0.6/maven-profile-2.0.6.jar
17:53:12 Progress (1): 4.1/116 kB
Progress (1): 8.2/116 kB
Progress (1): 12/116 kB 
Progress (1): 16/116 kB
Progress (1): 20/116 kB
Progress (1): 25/116 kB
Progress (1): 29/116 kB
Progress (1): 33/116 kB
Progress (1): 37/116 kB
Progress (1): 41/116 kB
Progress (1): 45/116 kB
Progress (1): 49/116 kB
Progress (1): 53/116 kB
Progress (1): 57/116 kB
Progress (1): 61/116 kB
Progress (1): 66/116 kB
Progress (1): 70/116 kB
Progress (1): 74/116 kB
Progress (1): 78/116 kB
Progress (1): 82/116 kB
Progress (1): 86/116 kB
Progress (1): 90/116 kB
Progress (1): 94/116 kB
Progress (1): 98/116 kB
Progress (1): 102/116 kB
Progress (1): 106/116 kB
Progress (1): 111/116 kB
Progress (1): 115/116 kB
Progress (1): 116 kB    
Progress (2): 116 kB | 4.1/57 kB
Progress (2): 116 kB | 8.2/57 kB
Progress (3): 116 kB | 8.2/57 kB | 4.1/29 kB
Progress (3): 116 kB | 12/57 kB | 4.1/29 kB 
Progress (3): 116 kB | 16/57 kB | 4.1/29 kB
Progress (3): 116 kB | 16/57 kB | 8.2/29 kB
Progress (4): 116 kB | 16/57 kB | 8.2/29 kB | 4.1/35 kB
Progress (4): 116 kB | 16/57 kB | 12/29 kB | 4.1/35 kB 
Progress (4): 116 kB | 16/57 kB | 12/29 kB | 8.2/35 kB
Progress (4): 116 kB | 16/57 kB | 16/29 kB | 8.2/35 kB
Progress (4): 116 kB | 16/57 kB | 16/29 kB | 12/35 kB 
Progress (4): 116 kB | 16/57 kB | 20/29 kB | 12/35 kB
Progress (4): 116 kB | 16/57 kB | 20/29 kB | 16/35 kB
Progress (4): 116 kB | 16/57 kB | 25/29 kB | 16/35 kB
Progress (4): 116 kB | 16/57 kB | 29/29 kB | 16/35 kB
Progress (4): 116 kB | 16/57 kB | 29/29 kB | 20/35 kB
Progress (4): 116 kB | 20/57 kB | 29/29 kB | 20/35 kB
Progress (4): 116 kB | 25/57 kB | 29/29 kB | 20/35 kB
Progress (4): 116 kB | 29/57 kB | 29/29 kB | 20/35 kB
Progress (4): 116 kB | 33/57 kB | 29/29 kB | 20/35 kB
Progress (4): 116 kB | 37/57 kB | 29/29 kB | 20/35 kB
Progress (4): 116 kB | 41/57 kB | 29/29 kB | 20/35 kB
Progress (4): 116 kB | 41/57 kB | 29/29 kB | 25/35 kB
Progress (4): 116 kB | 41/57 kB | 29/29 kB | 29/35 kB
Progress (4): 116 kB | 41/57 kB | 29/29 kB | 33/35 kB
Progress (4): 116 kB | 41/57 kB | 29 kB | 33/35 kB   
Progress (4): 116 kB | 41/57 kB | 29 kB | 35 kB   
Progress (4): 116 kB | 45/57 kB | 29 kB | 35 kB
Progress (4): 116 kB | 49/57 kB | 29 kB | 35 kB
Progress (4): 116 kB | 53/57 kB | 29 kB | 35 kB
Progress (4): 116 kB | 57 kB | 29 kB | 35 kB   
Progress (5): 116 kB | 57 kB | 29 kB | 35 kB | 4.1/152 kB
Progress (5): 116 kB | 57 kB | 29 kB | 35 kB | 8.2/152 kB
Progress (5): 116 kB | 57 kB | 29 kB | 35 kB | 12/152 kB 
Progress (5): 116 kB | 57 kB | 29 kB | 35 kB | 16/152 kB
Progress (5): 116 kB | 57 kB | 29 kB | 35 kB | 20/152 kB
Progress (5): 116 kB | 57 kB | 29 kB | 35 kB | 25/152 kB
Progress (5): 116 kB | 57 kB | 29 kB | 35 kB | 29/152 kB
Progress (5): 116 kB | 57 kB | 29 kB | 35 kB | 33/152 kB
Progress (5): 116 kB | 57 kB | 29 kB | 35 kB | 37/152 kB
Progress (5): 116 kB | 57 kB | 29 kB | 35 kB | 41/152 kB
Progress (5): 116 kB | 57 kB | 29 kB | 35 kB | 45/152 kB
Progress (5): 116 kB | 57 kB | 29 kB | 35 kB | 49/152 kB
Progress (5): 116 kB | 57 kB | 29 kB | 35 kB | 53/152 kB
Progress (5): 116 kB | 57 kB | 29 kB | 35 kB | 57/152 kB
Progress (5): 116 kB | 57 kB | 29 kB | 35 kB | 61/152 kB
Progress (5): 116 kB | 57 kB | 29 kB | 35 kB | 66/152 kB
Progress (5): 116 kB | 57 kB | 29 kB | 35 kB | 70/152 kB
Progress (5): 116 kB | 57 kB | 29 kB | 35 kB | 74/152 kB
Progress (5): 116 kB | 57 kB | 29 kB | 35 kB | 78/152 kB
Progress (5): 116 kB | 57 kB | 29 kB | 35 kB | 82/152 kB
Progress (5): 116 kB | 57 kB | 29 kB | 35 kB | 86/152 kB
Progress (5): 116 kB | 57 kB | 29 kB | 35 kB | 90/152 kB
Progress (5): 116 kB | 57 kB | 29 kB | 35 kB | 94/152 kB
Progress (5): 116 kB | 57 kB | 29 kB | 35 kB | 98/152 kB
Progress (5): 116 kB | 57 kB | 29 kB | 35 kB | 102/152 kB
Progress (5): 116 kB | 57 kB | 29 kB | 35 kB | 106/152 kB
Progress (5): 116 kB | 57 kB | 29 kB | 35 kB | 111/152 kB
Progress (5): 116 kB | 57 kB | 29 kB | 35 kB | 115/152 kB
Progress (5): 116 kB | 57 kB | 29 kB | 35 kB | 119/152 kB
Progress (5): 116 kB | 57 kB | 29 kB | 35 kB | 123/152 kB
Progress (5): 116 kB | 57 kB | 29 kB | 35 kB | 127/152 kB
Progress (5): 116 kB | 57 kB | 29 kB | 35 kB | 131/152 kB
Progress (5): 116 kB | 57 kB | 29 kB | 35 kB | 135/152 kB
Progress (5): 116 kB | 57 kB | 29 kB | 35 kB | 139/152 kB
Progress (5): 116 kB | 57 kB | 29 kB | 35 kB | 143/152 kB
Progress (5): 116 kB | 57 kB | 29 kB | 35 kB | 147/152 kB
Progress (5): 116 kB | 57 kB | 29 kB | 35 kB | 152/152 kB
Progress (5): 116 kB | 57 kB | 29 kB | 35 kB | 152 kB    
                                                     
Downloaded from central: https://repo.maven.apache.org/maven2/org/apache/maven/maven-project/2.0.6/maven-project-2.0.6.jar (116 kB at 1.2 MB/s)
17:53:12 Downloading from central: https://repo.maven.apache.org/maven2/org/apache/maven/maven-plugin-parameter-documenter/2.0.6/maven-plugin-parameter-documenter-2.0.6.jar
17:53:12 Downloaded from central: https://repo.maven.apache.org/maven2/org/apache/maven/maven-artifact-manager/2.0.6/maven-artifact-manager-2.0.6.jar (57 kB at 533 kB/s)
17:53:12 Downloading from central: https://repo.maven.apache.org/maven2/org/apache/maven/reporting/maven-reporting-api/2.0.6/maven-reporting-api-2.0.6.jar
17:53:12 Downloaded from central: https://repo.maven.apache.org/maven2/org/apache/maven/maven-plugin-registry/2.0.6/maven-plugin-registry-2.0.6.jar (29 kB at 270 kB/s)
17:53:12 Downloading from central: https://repo.maven.apache.org/maven2/org/apache/maven/doxia/doxia-sink-api/1.0-alpha-7/doxia-sink-api-1.0-alpha-7.jar
17:53:12 Downloaded from central: https://repo.maven.apache.org/maven2/org/apache/maven/maven-profile/2.0.6/maven-profile-2.0.6.jar (35 kB at 320 kB/s)
17:53:12 Downloading from central: https://repo.maven.apache.org/maven2/org/apache/maven/maven-repository-metadata/2.0.6/maven-repository-metadata-2.0.6.jar
17:53:12 Downloaded from central: https://repo.maven.apache.org/maven2/org/apache/maven/maven-core/2.0.6/maven-core-2.0.6.jar (152 kB at 1.3 MB/s)
17:53:12 Downloading from central: https://repo.maven.apache.org/maven2/org/apache/maven/maven-error-diagnostics/2.0.6/maven-error-diagnostics-2.0.6.jar
17:53:12 Progress (1): 4.1/21 kB
Progress (1): 8.2/21 kB
Progress (1): 12/21 kB 
Progress (1): 16/21 kB
Progress (1): 20/21 kB
Progress (1): 21 kB   
Progress (2): 21 kB | 4.1/5.9 kB
Progress (2): 21 kB | 5.9 kB    
Progress (3): 21 kB | 5.9 kB | 4.1/24 kB
Progress (3): 21 kB | 5.9 kB | 8.2/24 kB
Progress (3): 21 kB | 5.9 kB | 12/24 kB 
Progress (3): 21 kB | 5.9 kB | 16/24 kB
Progress (3): 21 kB | 5.9 kB | 20/24 kB
Progress (3): 21 kB | 5.9 kB | 24 kB   
Progress (4): 21 kB | 5.9 kB | 24 kB | 4.1/14 kB
Progress (4): 21 kB | 5.9 kB | 24 kB | 8.2/14 kB
Progress (4): 21 kB | 5.9 kB | 24 kB | 12/14 kB 
Progress (4): 21 kB | 5.9 kB | 24 kB | 14 kB   
Progress (5): 21 kB | 5.9 kB | 24 kB | 14 kB | 4.1/9.9 kB
Progress (5): 21 kB | 5.9 kB | 24 kB | 14 kB | 8.2/9.9 kB
Progress (5): 21 kB | 5.9 kB | 24 kB | 14 kB | 9.9 kB    
                                                     
Downloaded from central: https://repo.maven.apache.org/maven2/org/apache/maven/maven-plugin-parameter-documenter/2.0.6/maven-plugin-parameter-documenter-2.0.6.jar (21 kB at 142 kB/s)
17:53:12 Downloading from central: https://repo.maven.apache.org/maven2/commons-cli/commons-cli/1.0/commons-cli-1.0.jar
17:53:12 Downloaded from central: https://repo.maven.apache.org/maven2/org/apache/maven/maven-repository-metadata/2.0.6/maven-repository-metadata-2.0.6.jar (24 kB at 153 kB/s)
17:53:12 Downloaded from central: https://repo.maven.apache.org/maven2/org/apache/maven/doxia/doxia-sink-api/1.0-alpha-7/doxia-sink-api-1.0-alpha-7.jar (5.9 kB at 37 kB/s)
17:53:12 Downloading from central: https://repo.maven.apache.org/maven2/org/codehaus/plexus/plexus-interactivity-api/1.0-alpha-4/plexus-interactivity-api-1.0-alpha-4.jar
17:53:12 Downloading from central: https://repo.maven.apache.org/maven2/org/apache/maven/maven-plugin-descriptor/2.0.6/maven-plugin-descriptor-2.0.6.jar
17:53:12 Downloaded from central: https://repo.maven.apache.org/maven2/org/apache/maven/maven-error-diagnostics/2.0.6/maven-error-diagnostics-2.0.6.jar (14 kB at 82 kB/s)
17:53:12 Downloading from central: https://repo.maven.apache.org/maven2/classworlds/classworlds/1.1/classworlds-1.1.jar
17:53:12 Progress (2): 9.9 kB | 4.1/30 kB
Progress (2): 9.9 kB | 8.2/30 kB
Progress (2): 9.9 kB | 12/30 kB 
Progress (2): 9.9 kB | 16/30 kB
Progress (2): 9.9 kB | 20/30 kB
Progress (2): 9.9 kB | 25/30 kB
Progress (2): 9.9 kB | 29/30 kB
Progress (2): 9.9 kB | 30 kB   
                            
Downloaded from central: https://repo.maven.apache.org/maven2/org/apache/maven/reporting/maven-reporting-api/2.0.6/maven-reporting-api-2.0.6.jar (9.9 kB at 58 kB/s)
17:53:12 Downloading from central: https://repo.maven.apache.org/maven2/org/apache/maven/maven-artifact/2.0.6/maven-artifact-2.0.6.jar
17:53:12 Progress (2): 30 kB | 4.1/13 kB
Progress (2): 30 kB | 8.2/13 kB
Progress (2): 30 kB | 12/13 kB 
Progress (2): 30 kB | 13 kB   
Progress (3): 30 kB | 13 kB | 4.1/37 kB
Progress (3): 30 kB | 13 kB | 8.2/37 kB
Progress (3): 30 kB | 13 kB | 12/37 kB 
Progress (3): 30 kB | 13 kB | 16/37 kB
Progress (4): 30 kB | 13 kB | 16/37 kB | 4.1/38 kB
Progress (4): 30 kB | 13 kB | 20/37 kB | 4.1/38 kB
Progress (4): 30 kB | 13 kB | 25/37 kB | 4.1/38 kB
Progress (4): 30 kB | 13 kB | 29/37 kB | 4.1/38 kB
Progress (4): 30 kB | 13 kB | 29/37 kB | 8.2/38 kB
Progress (4): 30 kB | 13 kB | 33/37 kB | 8.2/38 kB
Progress (4): 30 kB | 13 kB | 37/37 kB | 8.2/38 kB
Progress (4): 30 kB | 13 kB | 37 kB | 8.2/38 kB   
Progress (4): 30 kB | 13 kB | 37 kB | 12/38 kB 
Progress (4): 30 kB | 13 kB | 37 kB | 16/38 kB
Progress (4): 30 kB | 13 kB | 37 kB | 20/38 kB
Progress (4): 30 kB | 13 kB | 37 kB | 25/38 kB
Progress (4): 30 kB | 13 kB | 37 kB | 29/38 kB
Progress (4): 30 kB | 13 kB | 37 kB | 33/38 kB
Progress (4): 30 kB | 13 kB | 37 kB | 37/38 kB
Progress (4): 30 kB | 13 kB | 37 kB | 38 kB   
                                           
Downloaded from central: https://repo.maven.apache.org/maven2/commons-cli/commons-cli/1.0/commons-cli-1.0.jar (30 kB at 149 kB/s)
17:53:12 Downloading from central: https://repo.maven.apache.org/maven2/org/apache/maven/maven-settings/2.0.6/maven-settings-2.0.6.jar
17:53:12 Downloaded from central: https://repo.maven.apache.org/maven2/org/codehaus/plexus/plexus-interactivity-api/1.0-alpha-4/plexus-interactivity-api-1.0-alpha-4.jar (13 kB at 64 kB/s)
17:53:12 Downloading from central: https://repo.maven.apache.org/maven2/org/apache/maven/maven-model/2.0.6/maven-model-2.0.6.jar
17:53:12 Downloaded from central: https://repo.maven.apache.org/maven2/org/apache/maven/maven-plugin-descriptor/2.0.6/maven-plugin-descriptor-2.0.6.jar (37 kB at 165 kB/s)
17:53:12 Downloading from central: https://repo.maven.apache.org/maven2/org/apache/maven/maven-monitor/2.0.6/maven-monitor-2.0.6.jar
17:53:12 Progress (2): 38 kB | 4.1/49 kB
Progress (2): 38 kB | 8.2/49 kB
Progress (2): 38 kB | 12/49 kB 
Progress (2): 38 kB | 16/49 kB
Progress (2): 38 kB | 20/49 kB
Progress (2): 38 kB | 25/49 kB
Progress (2): 38 kB | 29/49 kB
Progress (2): 38 kB | 33/49 kB
Progress (3): 38 kB | 33/49 kB | 4.1/86 kB
                                          
Downloaded from central: https://repo.maven.apache.org/maven2/classworlds/classworlds/1.1/classworlds-1.1.jar (38 kB at 162 kB/s)
17:53:12 Downloading from central: https://repo.maven.apache.org/maven2/org/apache/maven/shared/maven-filtering/1.0-beta-4/maven-filtering-1.0-beta-4.jar
17:53:12 Progress (2): 33/49 kB | 8.2/86 kB
Progress (2): 33/49 kB | 12/86 kB 
Progress (2): 33/49 kB | 16/86 kB
Progress (2): 33/49 kB | 20/86 kB
Progress (2): 37/49 kB | 20/86 kB
Progress (2): 37/49 kB | 25/86 kB
Progress (2): 41/49 kB | 25/86 kB
Progress (2): 45/49 kB | 25/86 kB
Progress (2): 45/49 kB | 29/86 kB
Progress (2): 49 kB | 29/86 kB   
Progress (2): 49 kB | 33/86 kB
Progress (2): 49 kB | 37/86 kB
Progress (2): 49 kB | 41/86 kB
Progress (2): 49 kB | 45/86 kB
Progress (2): 49 kB | 49/86 kB
Progress (2): 49 kB | 53/86 kB
Progress (2): 49 kB | 57/86 kB
Progress (2): 49 kB | 61/86 kB
Progress (2): 49 kB | 66/86 kB
Progress (2): 49 kB | 70/86 kB
Progress (2): 49 kB | 74/86 kB
Progress (2): 49 kB | 78/86 kB
Progress (2): 49 kB | 82/86 kB
Progress (2): 49 kB | 86/86 kB
Progress (2): 49 kB | 86 kB   
Progress (3): 49 kB | 86 kB | 4.1/87 kB
Progress (3): 49 kB | 86 kB | 8.2/87 kB
Progress (3): 49 kB | 86 kB | 12/87 kB 
Progress (3): 49 kB | 86 kB | 16/87 kB
Progress (4): 49 kB | 86 kB | 16/87 kB | 4.1/10 kB
Progress (4): 49 kB | 86 kB | 16/87 kB | 8.2/10 kB
Progress (4): 49 kB | 86 kB | 16/87 kB | 10 kB    
Progress (5): 49 kB | 86 kB | 16/87 kB | 10 kB | 4.1/35 kB
Progress (5): 49 kB | 86 kB | 16/87 kB | 10 kB | 8.2/35 kB
Progress (5): 49 kB | 86 kB | 16/87 kB | 10 kB | 12/35 kB 
Progress (5): 49 kB | 86 kB | 16/87 kB | 10 kB | 16/35 kB
Progress (5): 49 kB | 86 kB | 16/87 kB | 10 kB | 20/35 kB
Progress (5): 49 kB | 86 kB | 16/87 kB | 10 kB | 25/35 kB
Progress (5): 49 kB | 86 kB | 16/87 kB | 10 kB | 29/35 kB
Progress (5): 49 kB | 86 kB | 16/87 kB | 10 kB | 33/35 kB
Progress (5): 49 kB | 86 kB | 16/87 kB | 10 kB | 35 kB   
                                                      
Downloaded from central: https://repo.maven.apache.org/maven2/org/apache/maven/maven-settings/2.0.6/maven-settings-2.0.6.jar (49 kB at 186 kB/s)
17:53:12 Downloading from central: https://repo.maven.apache.org/maven2/org/sonatype/plexus/plexus-build-api/0.0.4/plexus-build-api-0.0.4.jar
17:53:12 Downloaded from central: https://repo.maven.apache.org/maven2/org/apache/maven/maven-model/2.0.6/maven-model-2.0.6.jar (86 kB at 318 kB/s)
17:53:12 Downloading from central: https://repo.maven.apache.org/maven2/org/codehaus/plexus/plexus-interpolation/1.13/plexus-interpolation-1.13.jar
17:53:12 Downloaded from central: https://repo.maven.apache.org/maven2/org/apache/maven/maven-monitor/2.0.6/maven-monitor-2.0.6.jar (10 kB at 37 kB/s)
17:53:12 Progress (3): 16/87 kB | 35 kB | 4.1/6.8 kB
Progress (3): 16/87 kB | 35 kB | 6.8 kB    
                                       
Downloaded from central: https://repo.maven.apache.org/maven2/org/apache/maven/shared/maven-filtering/1.0-beta-4/maven-filtering-1.0-beta-4.jar (35 kB at 118 kB/s)
17:53:12 Progress (2): 20/87 kB | 6.8 kB
Progress (2): 25/87 kB | 6.8 kB
Progress (2): 29/87 kB | 6.8 kB
Progress (2): 33/87 kB | 6.8 kB
Progress (2): 37/87 kB | 6.8 kB
Progress (2): 41/87 kB | 6.8 kB
Progress (2): 45/87 kB | 6.8 kB
Progress (2): 49/87 kB | 6.8 kB
Progress (2): 53/87 kB | 6.8 kB
Progress (2): 57/87 kB | 6.8 kB
Progress (2): 61/87 kB | 6.8 kB
Progress (2): 66/87 kB | 6.8 kB
Progress (2): 70/87 kB | 6.8 kB
Progress (2): 74/87 kB | 6.8 kB
Progress (2): 78/87 kB | 6.8 kB
Progress (2): 82/87 kB | 6.8 kB
Progress (2): 86/87 kB | 6.8 kB
Progress (2): 87 kB | 6.8 kB   
Progress (3): 87 kB | 6.8 kB | 4.1/61 kB
Progress (3): 87 kB | 6.8 kB | 8.2/61 kB
Progress (3): 87 kB | 6.8 kB | 12/61 kB 
Progress (3): 87 kB | 6.8 kB | 16/61 kB
Progress (3): 87 kB | 6.8 kB | 20/61 kB
Progress (3): 87 kB | 6.8 kB | 25/61 kB
Progress (3): 87 kB | 6.8 kB | 29/61 kB
Progress (3): 87 kB | 6.8 kB | 33/61 kB
Progress (3): 87 kB | 6.8 kB | 37/61 kB
Progress (3): 87 kB | 6.8 kB | 41/61 kB
Progress (3): 87 kB | 6.8 kB | 45/61 kB
Progress (3): 87 kB | 6.8 kB | 49/61 kB
Progress (3): 87 kB | 6.8 kB | 53/61 kB
Progress (3): 87 kB | 6.8 kB | 57/61 kB
Progress (3): 87 kB | 6.8 kB | 61 kB   
                                    
Downloaded from central: https://repo.maven.apache.org/maven2/org/sonatype/plexus/plexus-build-api/0.0.4/plexus-build-api-0.0.4.jar (6.8 kB at 22 kB/s)
17:53:12 Downloaded from central: https://repo.maven.apache.org/maven2/org/apache/maven/maven-artifact/2.0.6/maven-artifact-2.0.6.jar (87 kB at 271 kB/s)
17:53:12 Downloaded from central: https://repo.maven.apache.org/maven2/org/codehaus/plexus/plexus-interpolation/1.13/plexus-interpolation-1.13.jar (61 kB at 187 kB/s)
17:53:12 [INFO] Using 'UTF-8' encoding to copy filtered resources.
17:53:12 [INFO] skip non existing resourceDirectory C:\Jenkins\build\workspace\elexis-uitest-windows\elexis-master\src\main\resources
17:53:12 [INFO] 
17:53:12 [INFO] --- target-platform-configuration:1.7.0:target-platform (default-target-platform) @ elexis-master ---
17:53:12 [INFO] 
17:53:12 [INFO] --- tycho-p2-publisher-plugin:1.7.0:publish-osgi-ee (default-publish-osgi-ee) @ elexis-master ---
17:53:12 [INFO] Published profile IUs: [a.jre.javase 11.0.0, config.a.jre.javase 11.0.0]
17:53:12 [INFO] Published profile IUs: [a.jre.javase 14.0.0, config.a.jre.javase 14.0.0]
17:53:12 [INFO] 
17:53:12 [INFO] --- tycho-p2-publisher-plugin:1.7.0:publish-products (default-publish-products) @ elexis-master ---
17:53:12 [INFO] 
17:53:12 [INFO] --- tycho-p2-publisher-plugin:1.7.0:publish-categories (default-publish-categories) @ elexis-master ---
17:53:13 [INFO] 
17:53:13 [INFO] --- tycho-p2-publisher-plugin:1.7.0:attach-artifacts (default-attach-artifacts) @ elexis-master ---
17:53:13 [INFO] 
17:53:13 [INFO] --- tycho-p2-repository-plugin:1.7.0:assemble-repository (default-assemble-repository) @ elexis-master ---
17:53:13 [INFO] 
17:53:47 [INFO] --- tycho-p2-repository-plugin:1.7.0:archive-repository (default-archive-repository) @ elexis-master ---
17:53:47 [INFO] Building zip: C:\Jenkins\build\workspace\elexis-uitest-windows\elexis-master\target\elexis-master-3.9.zip
17:53:47 [INFO] 
17:53:53 [INFO] --- tycho-p2-director-plugin:1.7.0:materialize-products (materialize-products) @ elexis-master ---
17:53:53 [INFO] Installing product ElexisAllOpenSourceApp for environment win32/win32/x86_64 to C:\Jenkins\build\workspace\elexis-uitest-windows\elexis-master\target\products\ElexisAllOpenSourceApp\win32\win32\x86_64
17:53:54 Installing ElexisAllOpenSourceApp 3.9.0.
17:53:54 Installing at.gruber.elexis.mythic22.feature.feature.group 3.0.100.20201021-1138.
17:53:54 Installing at.medevit.elexis.agenda.feature.feature.group 1.0.100.20210519-1401.
17:53:54 Installing at.medevit.elexis.bluemedication.feature.feature.group 1.0.0.20201112-0828.
17:53:54 Installing at.medevit.elexis.cobasmira.feature.feature.group 3.0.100.20181207-1630.
17:53:54 Installing at.medevit.elexis.decision.feature.feature.group 3.0.100.20210608-1325.
17:53:54 Installing at.medevit.elexis.ehc.feature.feature.group 3.3.100.20210406-1157.
17:53:54 Installing at.medevit.elexis.emediplan.feature.feature.group 1.0.100.20210322-1429.
17:53:54 Installing at.medevit.elexis.gdt.defaultfilecp.feature.feature.group 3.1.100.20210203-1354.
17:53:54 Installing at.medevit.elexis.gdt.feature.feature.group 3.1.100.20210203-1354.
17:53:54 Installing at.medevit.elexis.impfplan.feature.feature.group 3.8.0.20210528-0841.
17:53:54 Installing at.medevit.elexis.inbox.feature.feature.group 3.0.100.20210122-1540.
17:53:54 Installing at.medevit.elexis.loinc.feature.feature.group 3.0.100.20200623-0838.
17:53:54 Installing at.medevit.elexis.medietikette.feature.feature.group 3.0.100.20200129-1200.
17:53:54 Installing ch.berchtold.privatrechnung.feature.feature.group 3.0.100.20210503-0656.
17:53:54 Installing ch.docbox.elexis.feature.feature.group 3.0.100.20210406-1157.
17:53:54 Installing ch.elexis.agenda.feature.feature.group 3.2.100.20210427-0818.
17:53:54 Installing ch.elexis.archie.patientstatistik.feature.feature.group 3.0.100.20201019-1344.
17:53:54 Installing ch.elexis.archie.wzw.feature.feature.group 3.0.100.20210421-1209.
17:53:54 Installing ch.elexis.barcode.scanner.feature.feature.group 3.2.100.20201021-1138.
17:53:54 Installing ch.elexis.base.befunde.feature.feature.group 3.0.100.20210525-0837.
17:53:54 Installing ch.elexis.base.ch.feature.feature.group 3.2.100.20210608-0841.
17:53:54 Installing ch.elexis.base.konsextension.bildanzeige.feature.feature.group 3.0.100.20181130-1349.
17:53:54 Installing ch.elexis.base.konsextension.privatnotizen.feature.feature.group 3.0.100.20181130-1343.
17:53:54 Installing ch.elexis.base.messages.feature.feature.group 3.0.100.20201021-1138.
17:53:54 Installing ch.elexis.base.messages.feature.feature.group 3.0.100.20201021-1138.
17:53:54 Installing ch.elexis.base.textplugin.feature.feature.group 3.0.100.20180614-0933.
17:53:54 Installing ch.elexis.base.textplugin.feature.feature.group 3.0.100.20180614-0933.
17:53:54 Installing ch.elexis.buchhaltung.basis.feature.feature.group 3.0.100.20190409-1417.
17:53:54 Installing ch.elexis.connect.afinion.feature.feature.group 3.0.100.20190409-1417.
17:53:54 Installing ch.elexis.connect.mythic.feature.feature.group 3.0.100.20210422-1002.
17:53:54 Installing ch.elexis.connect.reflotron.v2.feature.feature.group 3.0.100.20190409-1417.
17:53:54 Installing ch.elexis.connect.sysmex.feature.feature.group 3.0.100.20200417-1322.
17:53:54 Installing ch.elexis.connector.medicosearch.feature.feature.group 3.0.100.20200901-1213.
17:53:54 Installing ch.elexis.externe_dokumente.feature.feature.group 3.0.100.20200901-1913.
17:53:54 Installing ch.elexis.fop_wrapper.feature.feature.group 3.0.100.20200108-1208.
17:53:54 Installing ch.elexis.global_inbox.feature.feature.group 3.8.0.20210518-1054.
17:53:54 Installing ch.elexis.hl7.message.feature.feature.group 1.0.0.20200831-1449.
17:53:54 Installing ch.elexis.icpc.feature.feature.group 3.2.100.20200501-1250.
17:53:54 Installing ch.elexis.icpc.fire.feature.feature.group 3.2.100.20200901-1213.
17:53:54 Installing ch.elexis.impfplan.feature.feature.group 3.0.100.20191209-0913.
17:53:54 Installing ch.elexis.importer.aeskulap.feature.feature.group 1.0.0.20191209-0913.
17:53:54 Installing ch.elexis.kassenbuch.feature.feature.group 3.2.0.20201203-1605.
17:53:54 Installing ch.elexis.laborimport.analytica.feature.feature.group 3.1.100.20200831-1449.
17:53:54 Installing ch.elexis.laborimport.bioanalytica.feature.feature.group 3.0.100.20190411-1739.
17:53:54 Installing ch.elexis.laborimport.eurolyser.feature.feature.group 3.0.100.20201002-0856.
17:53:54 Installing ch.elexis.laborimport.hl7.allg.feature.feature.group 3.0.100.20210309-1518.
17:53:54 Installing ch.elexis.laborimport.medics.v2.feature.feature.group 3.0.100.20210309-1533.
17:53:54 Installing ch.elexis.laborimport.synlab.feature.feature.group 3.0.100.20190416-1030.
17:53:54 Installing ch.elexis.laborimport.teamw.feature.feature.group 3.1.100.20210203-1411.
17:53:54 Installing ch.elexis.laborimport.viollier.v2.feature.feature.group 3.0.100.20201002-0856.
17:53:54 Installing ch.elexis.laborimport_labtop.feature.feature.group 3.0.100.20180614-0933.
17:53:54 Installing ch.elexis.laborimport_lg1.feature.feature.group 3.0.100.20180614-0933.
17:53:54 Installing ch.elexis.laborimport_rischbern.feature.feature.group 3.0.100.20180614-0933.
17:53:54 Installing ch.elexis.laborimport_rothen.feature.feature.group 3.0.100.20180614-0933.
17:53:54 Installing ch.elexis.laborimport_viollier.feature.feature.group 3.0.100.20180309-1216.
17:53:54 Installing ch.elexis.labororder.lg1.feature.feature.group 1.0.0.20210406-1157.
17:53:54 Installing ch.elexis.molemax.feature.feature.group 3.0.100.20190128-1451.
17:53:54 Installing ch.elexis.notes.feature.feature.group 3.0.100.20190703-2009.
17:53:54 Installing ch.elexis.omnivore.feature.feature.group 3.2.100.20210602-1015.
17:53:54 Installing ch.elexis.privatrechnung.feature.feature.group 3.0.100.20210503-0656.
17:53:54 Installing ch.elexis.base.solr.feature.feature.group 1.0.0.20210421-1209.
17:53:54 Installing ch.elexis.stickynotes.feature.feature.group 3.0.100.20200924-1221.
17:53:54 Installing ch.elexis.support.dbshaker.feature.feature.group 3.0.100.20180309-1216.
17:53:54 Installing ch.gpb.elexis.cst.feature.feature.group 1.0.100.20200924-1221.
17:53:54 Installing ch.itmed.fop.printing.feature.feature.group 1.0.0.20210518-1340.
17:53:54 Installing ch.itmed.lmz.risch.laborder.feature.feature.group 3.7.0.20200901-1213.
17:53:54 Installing ch.medelexis.text.templator.feature.feature.group 3.0.100.20191115-1121.
17:53:54 Installing ch.medshare.connect.abacusjunior.feature.feature.group 3.0.100.20190411-1739.
17:53:54 Installing ch.medshare.elexis_directories.feature.feature.group 3.0.100.20180614-1456.
17:53:54 Installing ch.medshare.mediport.feature.feature.group 3.0.100.20201211-0824.
17:53:54 Installing ch.novcom.elexis.mednet.plugin.feature.feature.group 3.1.100.20201021-1138.
17:53:54 Installing ch.pharmed.phmprescriber.feature.feature.group 3.0.100.20200901-1213.
17:53:54 Installing ch.unibe.iam.scg.archie.feature.feature.group 3.0.100.20200831-1449.
17:53:54 Installing ch.weirich.templator.pages.feature.feature.group 3.0.100.20180309-1216.
17:53:54 Installing com.hilotec.elexis.kgview.feature.feature.group 3.0.100.20201002-0856.
17:53:54 Installing com.hilotec.elexis.messwerte.v2.feature.feature.group 3.0.100.20210406-1157.
17:53:54 Installing com.hilotec.elexis.opendocument.feature.feature.group 3.7.0.20190412-2013.
17:53:54 Installing at.medevit.medelexis.text.msword.feature.feature.group 3.8.0.20200611-1324.
17:53:54 Installing ch.medelexis.openoffice.feature.feature.group 3.8.0.20200611-1247.
17:53:54 Installing com.hilotec.elexis.opendocument2omnivore.feature.feature.group 3.0.100.20190430-1127.
17:53:54 Installing com.hilotec.elexis.pluginstatistiken.feature.feature.group 3.0.100.20201203-1126.
17:53:54 Installing com.hilotec.elexis.stickerprefix.feature.feature.group 3.0.100.20181207-1630.
17:53:54 Installing net.medshare.connector.aerztekasse.feature.feature.group 3.0.100.20201002-0856.
17:53:54 Installing net.medshare.connector.viollier.feature.feature.group 3.0.100.20201010-1213.
17:53:54 Installing org.iatrix.bestellung.rose.feature.feature.group 3.0.100.20210203-1734.
17:53:54 Installing org.iatrix.messwerte.feature.feature.group 3.0.100.20201118-1351.
17:53:54 Installing at.medbits.elexis.labbit.feature.feature.group 1.0.0.20200226-1024.
17:53:54 Installing org.eclipse.rcp.feature.group 4.15.0.v20200305-0155.
17:53:54 Installing org.eclipse.emf.common.feature.group 2.18.0.v20191225-1014.
17:53:54 Installing org.eclipse.emf.ecore.feature.group 2.21.0.v20200127-1342.
17:53:54 Installing org.eclipse.e4.rcp.feature.group 4.15.0.v20200304-0601.
17:53:54 Installing ch.elexis.core.application.feature.feature.group 3.9.0.20210604-0914.
17:53:54 Installing ch.elexis.core.common.feature.feature.group 3.9.0.20210604-1139.
17:53:54 Installing ch.elexis.core.logging.feature.feature.group 3.9.0.20210203-1259.
17:53:54 Installing ch.elexis.core.persistence.feature.feature.group 1.0.0.20210607-1153.
17:53:54 Installing ch.elexis.core.spotlight.feature.feature.group 1.0.0.20210421-1209.
17:53:54 Installing ch.elexis.core.tasks.feature.feature.group 1.0.0.20210507-1842.
17:53:54 Installing ch.elexis.core.ui.chromium.feature.feature.group 1.0.1.20210419-0340.
17:53:54 Installing ch.elexis.core.ui.eenv.feature.feature.group 1.0.0.20210406-1152.
17:53:54 Installing ch.elexis.core.ui.feature.feature.group 3.9.0.20210608-1106.
17:53:54 Installing ch.elexis.core.ui.p2.feature.feature.group 3.9.0.20200226-0838.
17:53:54 Installing ch.elexis.jre.feature.feature.group 3.9.0.20200728-1155.
17:53:54 Operation completed in 26216 ms.
17:54:21 [INFO] 
17:54:21 [INFO] --- tycho-p2-director-plugin:1.7.0:archive-products (archive-products) @ elexis-master ---
17:54:21 [INFO] Building zip: C:\Jenkins\build\workspace\elexis-uitest-windows\elexis-master\target\products\ElexisAllOpenSourceApp-win32.win32.x86_64.zip
17:54:22 [INFO] 
17:54:32 [INFO] -----------------------< ch.elexis.rcptt:setup >------------------------
17:54:32 [INFO] Building setup 0.1                                                 [2/4]
17:54:32 [INFO] --------------------------------[ pom ]---------------------------------
17:54:32 Downloading from rcptt-releases: https://repo.eclipse.org/content/repositories/rcptt-releases/org/apache/maven/plugins/maven-clean-plugin/2.4.1/maven-clean-plugin-2.4.1.pom
17:54:32 Downloading from rcptt-snapshots: https://repo.eclipse.org/content/repositories/rcptt-snapshots/org/apache/maven/plugins/maven-clean-plugin/2.4.1/maven-clean-plugin-2.4.1.pom
17:54:33 Downloading from central: https://repo.maven.apache.org/maven2/org/apache/maven/plugins/maven-clean-plugin/2.4.1/maven-clean-plugin-2.4.1.pom
17:54:33 Progress (1): 4.1/4.2 kB
Progress (1): 4.2 kB    
                    
Downloaded from central: https://repo.maven.apache.org/maven2/org/apache/maven/plugins/maven-clean-plugin/2.4.1/maven-clean-plugin-2.4.1.pom (4.2 kB at 57 kB/s)
17:54:33 Downloading from rcptt-releases: https://repo.eclipse.org/content/repositories/rcptt-releases/org/apache/maven/plugins/maven-clean-plugin/2.4.1/maven-clean-plugin-2.4.1.jar
17:54:33 Downloading from rcptt-snapshots: https://repo.eclipse.org/content/repositories/rcptt-snapshots/org/apache/maven/plugins/maven-clean-plugin/2.4.1/maven-clean-plugin-2.4.1.jar
17:54:34 Downloading from central: https://repo.maven.apache.org/maven2/org/apache/maven/plugins/maven-clean-plugin/2.4.1/maven-clean-plugin-2.4.1.jar
17:54:35 Progress (1): 4.1/24 kB
Progress (1): 8.2/24 kB
Progress (1): 12/24 kB 
Progress (1): 16/24 kB
Progress (1): 20/24 kB
Progress (1): 24 kB   
                   
Downloaded from central: https://repo.maven.apache.org/maven2/org/apache/maven/plugins/maven-clean-plugin/2.4.1/maven-clean-plugin-2.4.1.jar (24 kB at 491 kB/s)
17:54:35 Downloading from rcptt-releases: https://repo.eclipse.org/content/repositories/rcptt-releases/org/apache/maven/plugins/maven-scm-plugin/1.0/maven-scm-plugin-1.0.pom
17:54:35 Downloading from rcptt-snapshots: https://repo.eclipse.org/content/repositories/rcptt-snapshots/org/apache/maven/plugins/maven-scm-plugin/1.0/maven-scm-plugin-1.0.pom
17:54:35 Downloading from central: https://repo.maven.apache.org/maven2/org/apache/maven/plugins/maven-scm-plugin/1.0/maven-scm-plugin-1.0.pom
17:54:36 Progress (1): 4.1/4.2 kB
Progress (1): 4.2 kB    
                    
Downloaded from central: https://repo.maven.apache.org/maven2/org/apache/maven/plugins/maven-scm-plugin/1.0/maven-scm-plugin-1.0.pom (4.2 kB at 30 kB/s)
17:54:36 Downloading from rcptt-releases: https://repo.eclipse.org/content/repositories/rcptt-releases/org/apache/maven/scm/maven-scm/1.0/maven-scm-1.0.pom
17:54:36 Downloading from rcptt-snapshots: https://repo.eclipse.org/content/repositories/rcptt-snapshots/org/apache/maven/scm/maven-scm/1.0/maven-scm-1.0.pom
17:54:37 Downloading from central: https://repo.maven.apache.org/maven2/org/apache/maven/scm/maven-scm/1.0/maven-scm-1.0.pom
17:54:37 Progress (1): 4.1/6.1 kB
Progress (1): 6.1 kB    
                    
Downloaded from central: https://repo.maven.apache.org/maven2/org/apache/maven/scm/maven-scm/1.0/maven-scm-1.0.pom (6.1 kB at 100 kB/s)
17:54:37 Downloading from rcptt-releases: https://repo.eclipse.org/content/repositories/rcptt-releases/org/apache/maven/plugins/maven-scm-plugin/1.0/maven-scm-plugin-1.0.jar
17:54:37 Downloading from rcptt-snapshots: https://repo.eclipse.org/content/repositories/rcptt-snapshots/org/apache/maven/plugins/maven-scm-plugin/1.0/maven-scm-plugin-1.0.jar
17:54:38 Downloading from central: https://repo.maven.apache.org/maven2/org/apache/maven/plugins/maven-scm-plugin/1.0/maven-scm-plugin-1.0.jar
17:54:39 Progress (1): 4.1/39 kB
Progress (1): 8.2/39 kB
Progress (1): 12/39 kB 
Progress (1): 16/39 kB
Progress (1): 20/39 kB
Progress (1): 25/39 kB
Progress (1): 29/39 kB
Progress (1): 33/39 kB
Progress (1): 37/39 kB
Progress (1): 39 kB   
                   
Downloaded from central: https://repo.maven.apache.org/maven2/org/apache/maven/plugins/maven-scm-plugin/1.0/maven-scm-plugin-1.0.jar (39 kB at 166 kB/s)
17:54:39 Downloading from rcptt-releases: https://repo.eclipse.org/content/repositories/rcptt-releases/org/apache/maven/plugins/maven-antrun-plugin/1.8/maven-antrun-plugin-1.8.pom
17:54:39 Downloading from rcptt-snapshots: https://repo.eclipse.org/content/repositories/rcptt-snapshots/org/apache/maven/plugins/maven-antrun-plugin/1.8/maven-antrun-plugin-1.8.pom
17:54:39 Downloading from central: https://repo.maven.apache.org/maven2/org/apache/maven/plugins/maven-antrun-plugin/1.8/maven-antrun-plugin-1.8.pom
17:54:40 Progress (1): 3.3 kB
                    
Downloaded from central: https://repo.maven.apache.org/maven2/org/apache/maven/plugins/maven-antrun-plugin/1.8/maven-antrun-plugin-1.8.pom (3.3 kB at 72 kB/s)
17:54:40 Downloading from rcptt-releases: https://repo.eclipse.org/content/repositories/rcptt-releases/org/apache/maven/plugins/maven-plugins/27/maven-plugins-27.pom
17:54:40 Downloading from rcptt-snapshots: https://repo.eclipse.org/content/repositories/rcptt-snapshots/org/apache/maven/plugins/maven-plugins/27/maven-plugins-27.pom
17:54:41 Downloading from central: https://repo.maven.apache.org/maven2/org/apache/maven/plugins/maven-plugins/27/maven-plugins-27.pom
17:54:41 Progress (1): 4.1/11 kB
Progress (1): 8.2/11 kB
Progress (1): 11 kB    
                   
Downloaded from central: https://repo.maven.apache.org/maven2/org/apache/maven/plugins/maven-plugins/27/maven-plugins-27.pom (11 kB at 210 kB/s)
17:54:41 Downloading from rcptt-releases: https://repo.eclipse.org/content/repositories/rcptt-releases/org/apache/maven/maven-parent/26/maven-parent-26.pom
17:54:41 Downloading from rcptt-snapshots: https://repo.eclipse.org/content/repositories/rcptt-snapshots/org/apache/maven/maven-parent/26/maven-parent-26.pom
17:54:46 Downloading from central: https://repo.maven.apache.org/maven2/org/apache/maven/maven-parent/26/maven-parent-26.pom
17:54:46 Progress (1): 4.1/40 kB
Progress (1): 8.2/40 kB
Progress (1): 12/40 kB 
Progress (1): 16/40 kB
Progress (1): 20/40 kB
Progress (1): 25/40 kB
Progress (1): 29/40 kB
Progress (1): 33/40 kB
Progress (1): 37/40 kB
Progress (1): 40 kB   
                   
Downloaded from central: https://repo.maven.apache.org/maven2/org/apache/maven/maven-parent/26/maven-parent-26.pom (40 kB at 751 kB/s)
17:54:46 Downloading from rcptt-releases: https://repo.eclipse.org/content/repositories/rcptt-releases/org/apache/maven/plugins/maven-antrun-plugin/1.8/maven-antrun-plugin-1.8.jar
17:54:46 Downloading from rcptt-snapshots: https://repo.eclipse.org/content/repositories/rcptt-snapshots/org/apache/maven/plugins/maven-antrun-plugin/1.8/maven-antrun-plugin-1.8.jar
17:54:47 Downloading from central: https://repo.maven.apache.org/maven2/org/apache/maven/plugins/maven-antrun-plugin/1.8/maven-antrun-plugin-1.8.jar
17:54:48 Progress (1): 4.1/36 kB
Progress (1): 8.2/36 kB
Progress (1): 12/36 kB 
Progress (1): 16/36 kB
Progress (1): 20/36 kB
Progress (1): 25/36 kB
Progress (1): 29/36 kB
Progress (1): 33/36 kB
Progress (1): 36 kB   
                   
Downloaded from central: https://repo.maven.apache.org/maven2/org/apache/maven/plugins/maven-antrun-plugin/1.8/maven-antrun-plugin-1.8.jar (36 kB at 706 kB/s)
17:54:48 Downloading from rcptt-releases: https://repo.eclipse.org/content/repositories/rcptt-releases/com/googlecode/maven-download-plugin/download-maven-plugin/1.4.1/download-maven-plugin-1.4.1.pom
17:54:48 Downloading from rcptt-snapshots: https://repo.eclipse.org/content/repositories/rcptt-snapshots/com/googlecode/maven-download-plugin/download-maven-plugin/1.4.1/download-maven-plugin-1.4.1.pom
17:54:48 Downloading from central: https://repo.maven.apache.org/maven2/com/googlecode/maven-download-plugin/download-maven-plugin/1.4.1/download-maven-plugin-1.4.1.pom
17:54:49 Progress (1): 4.1/11 kB
Progress (1): 8.2/11 kB
Progress (1): 11 kB    
                   
Downloaded from central: https://repo.maven.apache.org/maven2/com/googlecode/maven-download-plugin/download-maven-plugin/1.4.1/download-maven-plugin-1.4.1.pom (11 kB at 216 kB/s)
17:54:49 Downloading from rcptt-releases: https://repo.eclipse.org/content/repositories/rcptt-releases/com/googlecode/maven-download-plugin/download-maven-plugin/1.4.1/download-maven-plugin-1.4.1.jar
17:54:49 Downloading from rcptt-snapshots: https://repo.eclipse.org/content/repositories/rcptt-snapshots/com/googlecode/maven-download-plugin/download-maven-plugin/1.4.1/download-maven-plugin-1.4.1.jar
17:54:49 Downloading from central: https://repo.maven.apache.org/maven2/com/googlecode/maven-download-plugin/download-maven-plugin/1.4.1/download-maven-plugin-1.4.1.jar
17:54:50 Progress (1): 4.1/36 kB
Progress (1): 8.2/36 kB
Progress (1): 12/36 kB 
Progress (1): 16/36 kB
Progress (1): 20/36 kB
Progress (1): 25/36 kB
Progress (1): 29/36 kB
Progress (1): 33/36 kB
Progress (1): 36 kB   
                   
Downloaded from central: https://repo.maven.apache.org/maven2/com/googlecode/maven-download-plugin/download-maven-plugin/1.4.1/download-maven-plugin-1.4.1.jar (36 kB at 645 kB/s)
17:54:50 [INFO] 
17:54:50 [INFO] --- maven-clean-plugin:2.4.1:clean (default-clean) @ setup ---
17:54:50 [INFO] Deleting C:\tmp (includes = [elexis*db], excludes = [])
17:54:50 [INFO] 
17:54:50 [INFO] --- maven-scm-plugin:1.0:checkout (checkout) @ setup ---
17:54:50 Downloading from rcptt-releases: https://repo.eclipse.org/content/repositories/rcptt-releases/org/codehaus/plexus/plexus-utils/2.1/plexus-utils-2.1.pom
17:54:50 Downloading from rcptt-snapshots: https://repo.eclipse.org/content/repositories/rcptt-snapshots/org/codehaus/plexus/plexus-utils/2.1/plexus-utils-2.1.pom
17:54:51 Downloading from central: https://repo.maven.apache.org/maven2/org/codehaus/plexus/plexus-utils/2.1/plexus-utils-2.1.pom
17:54:51 Progress (1): 4.0 kB
                    
Downloaded from central: https://repo.maven.apache.org/maven2/org/codehaus/plexus/plexus-utils/2.1/plexus-utils-2.1.pom (4.0 kB at 75 kB/s)
17:54:51 Downloading from rcptt-releases: https://repo.eclipse.org/content/repositories/rcptt-releases/org/apache/maven/scm/maven-scm-provider-gitexe/1.2/maven-scm-provider-gitexe-1.2.pom
17:54:51 Downloading from rcptt-snapshots: https://repo.eclipse.org/content/repositories/rcptt-snapshots/org/apache/maven/scm/maven-scm-provider-gitexe/1.2/maven-scm-provider-gitexe-1.2.pom
17:54:52 Downloading from central: https://repo.maven.apache.org/maven2/org/apache/maven/scm/maven-scm-provider-gitexe/1.2/maven-scm-provider-gitexe-1.2.pom
17:54:53 Progress (1): 2.3 kB
                    
Downloaded from central: https://repo.maven.apache.org/maven2/org/apache/maven/scm/maven-scm-provider-gitexe/1.2/maven-scm-provider-gitexe-1.2.pom (2.3 kB at 23 kB/s)
17:54:53 Downloading from rcptt-releases: https://repo.eclipse.org/content/repositories/rcptt-releases/org/apache/maven/scm/maven-scm-providers-git/1.2/maven-scm-providers-git-1.2.pom
17:54:53 Downloading from rcptt-snapshots: https://repo.eclipse.org/content/repositories/rcptt-snapshots/org/apache/maven/scm/maven-scm-providers-git/1.2/maven-scm-providers-git-1.2.pom
17:54:53 Downloading from central: https://repo.maven.apache.org/maven2/org/apache/maven/scm/maven-scm-providers-git/1.2/maven-scm-providers-git-1.2.pom
17:54:54 Progress (1): 1.7 kB
                    
Downloaded from central: https://repo.maven.apache.org/maven2/org/apache/maven/scm/maven-scm-providers-git/1.2/maven-scm-providers-git-1.2.pom (1.7 kB at 17 kB/s)
17:54:54 Downloading from rcptt-releases: https://repo.eclipse.org/content/repositories/rcptt-releases/org/apache/maven/scm/maven-scm-providers/1.2/maven-scm-providers-1.2.pom
17:54:54 Downloading from rcptt-snapshots: https://repo.eclipse.org/content/repositories/rcptt-snapshots/org/apache/maven/scm/maven-scm-providers/1.2/maven-scm-providers-1.2.pom
17:54:55 Downloading from central: https://repo.maven.apache.org/maven2/org/apache/maven/scm/maven-scm-providers/1.2/maven-scm-providers-1.2.pom
17:54:55 Progress (1): 3.6 kB
                    
Downloaded from central: https://repo.maven.apache.org/maven2/org/apache/maven/scm/maven-scm-providers/1.2/maven-scm-providers-1.2.pom (3.6 kB at 71 kB/s)
17:54:55 Downloading from rcptt-releases: https://repo.eclipse.org/content/repositories/rcptt-releases/org/apache/maven/scm/maven-scm/1.2/maven-scm-1.2.pom
17:54:55 Downloading from rcptt-snapshots: https://repo.eclipse.org/content/repositories/rcptt-snapshots/org/apache/maven/scm/maven-scm/1.2/maven-scm-1.2.pom
17:54:56 Downloading from central: https://repo.maven.apache.org/maven2/org/apache/maven/scm/maven-scm/1.2/maven-scm-1.2.pom
17:54:57 Progress (1): 4.1/12 kB
Progress (1): 8.2/12 kB
Progress (1): 12 kB    
                   
Downloaded from central: https://repo.maven.apache.org/maven2/org/apache/maven/scm/maven-scm/1.2/maven-scm-1.2.pom (12 kB at 181 kB/s)
17:54:57 Downloading from rcptt-releases: https://repo.eclipse.org/content/repositories/rcptt-releases/regexp/regexp/1.3/regexp-1.3.pom
17:54:57 Downloading from rcptt-snapshots: https://repo.eclipse.org/content/repositories/rcptt-snapshots/regexp/regexp/1.3/regexp-1.3.pom
17:54:57 Downloading from central: https://repo.maven.apache.org/maven2/regexp/regexp/1.3/regexp-1.3.pom
17:54:58 Progress (1): 145 B
                   
Downloaded from central: https://repo.maven.apache.org/maven2/regexp/regexp/1.3/regexp-1.3.pom (145 B at 2.8 kB/s)
17:54:58 Downloading from rcptt-releases: https://repo.eclipse.org/content/repositories/rcptt-releases/org/apache/maven/scm/maven-scm-provider-git-commons/1.2/maven-scm-provider-git-commons-1.2.pom
17:54:58 Downloading from rcptt-snapshots: https://repo.eclipse.org/content/repositories/rcptt-snapshots/org/apache/maven/scm/maven-scm-provider-git-commons/1.2/maven-scm-provider-git-commons-1.2.pom
17:54:59 Downloading from central: https://repo.maven.apache.org/maven2/org/apache/maven/scm/maven-scm-provider-git-commons/1.2/maven-scm-provider-git-commons-1.2.pom
17:54:59 Progress (1): 2.1 kB
                    
Downloaded from central: https://repo.maven.apache.org/maven2/org/apache/maven/scm/maven-scm-provider-git-commons/1.2/maven-scm-provider-git-commons-1.2.pom (2.1 kB at 38 kB/s)
17:54:59 Downloading from rcptt-releases: https://repo.eclipse.org/content/repositories/rcptt-releases/org/apache/maven/scm/maven-scm-api/1.2/maven-scm-api-1.2.pom
17:54:59 Downloading from rcptt-snapshots: https://repo.eclipse.org/content/repositories/rcptt-snapshots/org/apache/maven/scm/maven-scm-api/1.2/maven-scm-api-1.2.pom
17:55:00 Downloading from central: https://repo.maven.apache.org/maven2/org/apache/maven/scm/maven-scm-api/1.2/maven-scm-api-1.2.pom
17:55:01 Progress (1): 1.6 kB
                    
Downloaded from central: https://repo.maven.apache.org/maven2/org/apache/maven/scm/maven-scm-api/1.2/maven-scm-api-1.2.pom (1.6 kB at 33 kB/s)
17:55:01 Downloading from rcptt-releases: https://repo.eclipse.org/content/repositories/rcptt-releases/org/codehaus/plexus/plexus-utils/1.5.6/plexus-utils-1.5.6.pom
17:55:01 Downloading from rcptt-snapshots: https://repo.eclipse.org/content/repositories/rcptt-snapshots/org/codehaus/plexus/plexus-utils/1.5.6/plexus-utils-1.5.6.pom
17:55:01 Downloading from central: https://repo.maven.apache.org/maven2/org/codehaus/plexus/plexus-utils/1.5.6/plexus-utils-1.5.6.pom
17:55:02 Progress (1): 4.1/5.3 kB
Progress (1): 5.3 kB    
                    
Downloaded from central: https://repo.maven.apache.org/maven2/org/codehaus/plexus/plexus-utils/1.5.6/plexus-utils-1.5.6.pom (5.3 kB at 106 kB/s)
17:55:02 Downloading from rcptt-releases: https://repo.eclipse.org/content/repositories/rcptt-releases/org/codehaus/plexus/plexus/1.0.12/plexus-1.0.12.pom
17:55:02 Downloading from rcptt-snapshots: https://repo.eclipse.org/content/repositories/rcptt-snapshots/org/codehaus/plexus/plexus/1.0.12/plexus-1.0.12.pom
17:55:02 Downloading from central: https://repo.maven.apache.org/maven2/org/codehaus/plexus/plexus/1.0.12/plexus-1.0.12.pom
17:55:03 Progress (1): 4.1/9.8 kB
Progress (1): 8.2/9.8 kB
Progress (1): 9.8 kB    
                    
Downloaded from central: https://repo.maven.apache.org/maven2/org/codehaus/plexus/plexus/1.0.12/plexus-1.0.12.pom (9.8 kB at 134 kB/s)
17:55:03 Downloading from rcptt-releases: https://repo.eclipse.org/content/repositories/rcptt-releases/org/apache/maven/maven-project/2.0/maven-project-2.0.pom
17:55:03 Downloading from rcptt-snapshots: https://repo.eclipse.org/content/repositories/rcptt-snapshots/org/apache/maven/maven-project/2.0/maven-project-2.0.pom
17:55:04 Downloading from central: https://repo.maven.apache.org/maven2/org/apache/maven/maven-project/2.0/maven-project-2.0.pom
17:55:04 Progress (1): 1.6 kB
                    
Downloaded from central: https://repo.maven.apache.org/maven2/org/apache/maven/maven-project/2.0/maven-project-2.0.pom (1.6 kB at 31 kB/s)
17:55:04 Downloading from rcptt-releases: https://repo.eclipse.org/content/repositories/rcptt-releases/org/apache/maven/maven/2.0/maven-2.0.pom
17:55:04 Downloading from rcptt-snapshots: https://repo.eclipse.org/content/repositories/rcptt-snapshots/org/apache/maven/maven/2.0/maven-2.0.pom
17:55:05 Downloading from central: https://repo.maven.apache.org/maven2/org/apache/maven/maven/2.0/maven-2.0.pom
17:55:06 Progress (1): 4.1/8.8 kB
Progress (1): 8.2/8.8 kB
Progress (1): 8.8 kB    
                    
Downloaded from central: https://repo.maven.apache.org/maven2/org/apache/maven/maven/2.0/maven-2.0.pom (8.8 kB at 165 kB/s)
17:55:06 Downloading from rcptt-releases: https://repo.eclipse.org/content/repositories/rcptt-releases/org/apache/maven/maven-profile/2.0/maven-profile-2.0.pom
17:55:06 Downloading from rcptt-snapshots: https://repo.eclipse.org/content/repositories/rcptt-snapshots/org/apache/maven/maven-profile/2.0/maven-profile-2.0.pom
17:55:06 Downloading from central: https://repo.maven.apache.org/maven2/org/apache/maven/maven-profile/2.0/maven-profile-2.0.pom
17:55:07 Progress (1): 1.4 kB
                    
Downloaded from central: https://repo.maven.apache.org/maven2/org/apache/maven/maven-profile/2.0/maven-profile-2.0.pom (1.4 kB at 24 kB/s)
17:55:07 Downloading from rcptt-releases: https://repo.eclipse.org/content/repositories/rcptt-releases/org/apache/maven/maven-model/2.0/maven-model-2.0.pom
17:55:07 Downloading from rcptt-snapshots: https://repo.eclipse.org/content/repositories/rcptt-snapshots/org/apache/maven/maven-model/2.0/maven-model-2.0.pom
17:55:08 Downloading from central: https://repo.maven.apache.org/maven2/org/apache/maven/maven-model/2.0/maven-model-2.0.pom
17:55:08 Progress (1): 2.4 kB
                    
Downloaded from central: https://repo.maven.apache.org/maven2/org/apache/maven/maven-model/2.0/maven-model-2.0.pom (2.4 kB at 48 kB/s)
17:55:08 Downloading from rcptt-releases: https://repo.eclipse.org/content/repositories/rcptt-releases/org/codehaus/plexus/plexus-container-default/1.0-alpha-8/plexus-container-default-1.0-alpha-8.pom
17:55:08 Downloading from rcptt-snapshots: https://repo.eclipse.org/content/repositories/rcptt-snapshots/org/codehaus/plexus/plexus-container-default/1.0-alpha-8/plexus-container-default-1.0-alpha-8.pom
17:55:09 Downloading from central: https://repo.maven.apache.org/maven2/org/codehaus/plexus/plexus-container-default/1.0-alpha-8/plexus-container-default-1.0-alpha-8.pom
17:55:10 Progress (1): 4.1/7.3 kB
Progress (1): 7.3 kB    
                    
Downloaded from central: https://repo.maven.apache.org/maven2/org/codehaus/plexus/plexus-container-default/1.0-alpha-8/plexus-container-default-1.0-alpha-8.pom (7.3 kB at 132 kB/s)
17:55:10 Downloading from rcptt-releases: https://repo.eclipse.org/content/repositories/rcptt-releases/org/apache/maven/maven-artifact-manager/2.0/maven-artifact-manager-2.0.pom
17:55:10 Downloading from rcptt-snapshots: https://repo.eclipse.org/content/repositories/rcptt-snapshots/org/apache/maven/maven-artifact-manager/2.0/maven-artifact-manager-2.0.pom
17:55:10 Downloading from central: https://repo.maven.apache.org/maven2/org/apache/maven/maven-artifact-manager/2.0/maven-artifact-manager-2.0.pom
17:55:11 Progress (1): 1.3 kB
                    
Downloaded from central: https://repo.maven.apache.org/maven2/org/apache/maven/maven-artifact-manager/2.0/maven-artifact-manager-2.0.pom (1.3 kB at 21 kB/s)
17:55:11 Downloading from rcptt-releases: https://repo.eclipse.org/content/repositories/rcptt-releases/org/apache/maven/maven-repository-metadata/2.0/maven-repository-metadata-2.0.pom
17:55:11 Downloading from rcptt-snapshots: https://repo.eclipse.org/content/repositories/rcptt-snapshots/org/apache/maven/maven-repository-metadata/2.0/maven-repository-metadata-2.0.pom
17:55:11 Downloading from central: https://repo.maven.apache.org/maven2/org/apache/maven/maven-repository-metadata/2.0/maven-repository-metadata-2.0.pom
17:55:12 Progress (1): 1.2 kB
                    
Downloaded from central: https://repo.maven.apache.org/maven2/org/apache/maven/maven-repository-metadata/2.0/maven-repository-metadata-2.0.pom (1.2 kB at 22 kB/s)
17:55:12 Downloading from rcptt-releases: https://repo.eclipse.org/content/repositories/rcptt-releases/org/apache/maven/maven-artifact/2.0/maven-artifact-2.0.pom
17:55:12 Downloading from rcptt-snapshots: https://repo.eclipse.org/content/repositories/rcptt-snapshots/org/apache/maven/maven-artifact/2.0/maven-artifact-2.0.pom
17:55:13 Downloading from central: https://repo.maven.apache.org/maven2/org/apache/maven/maven-artifact/2.0/maven-artifact-2.0.pom
17:55:14 Progress (1): 723 B
                   
Downloaded from central: https://repo.maven.apache.org/maven2/org/apache/maven/maven-artifact/2.0/maven-artifact-2.0.pom (723 B at 13 kB/s)
17:55:14 Downloading from rcptt-releases: https://repo.eclipse.org/content/repositories/rcptt-releases/org/apache/maven/maven-settings/2.0/maven-settings-2.0.pom
17:55:14 Downloading from rcptt-snapshots: https://repo.eclipse.org/content/repositories/rcptt-snapshots/org/apache/maven/maven-settings/2.0/maven-settings-2.0.pom
17:55:14 Downloading from central: https://repo.maven.apache.org/maven2/org/apache/maven/maven-settings/2.0/maven-settings-2.0.pom
17:55:15 Progress (1): 1.4 kB
                    
Downloaded from central: https://repo.maven.apache.org/maven2/org/apache/maven/maven-settings/2.0/maven-settings-2.0.pom (1.4 kB at 25 kB/s)
17:55:15 Downloading from rcptt-releases: https://repo.eclipse.org/content/repositories/rcptt-releases/org/apache/maven/maven-plugin-api/2.0/maven-plugin-api-2.0.pom
17:55:15 Downloading from rcptt-snapshots: https://repo.eclipse.org/content/repositories/rcptt-snapshots/org/apache/maven/maven-plugin-api/2.0/maven-plugin-api-2.0.pom
17:55:15 Downloading from central: https://repo.maven.apache.org/maven2/org/apache/maven/maven-plugin-api/2.0/maven-plugin-api-2.0.pom
17:55:16 Progress (1): 601 B
                   
Downloaded from central: https://repo.maven.apache.org/maven2/org/apache/maven/maven-plugin-api/2.0/maven-plugin-api-2.0.pom (601 B at 8.7 kB/s)
17:55:16 Downloading from rcptt-releases: https://repo.eclipse.org/content/repositories/rcptt-releases/org/apache/maven/scm/maven-scm-manager-plexus/1.0/maven-scm-manager-plexus-1.0.pom
17:55:16 Downloading from rcptt-snapshots: https://repo.eclipse.org/content/repositories/rcptt-snapshots/org/apache/maven/scm/maven-scm-manager-plexus/1.0/maven-scm-manager-plexus-1.0.pom
17:55:17 Downloading from central: https://repo.maven.apache.org/maven2/org/apache/maven/scm/maven-scm-manager-plexus/1.0/maven-scm-manager-plexus-1.0.pom
17:55:21 Progress (1): 999 B
                   
Downloaded from central: https://repo.maven.apache.org/maven2/org/apache/maven/scm/maven-scm-manager-plexus/1.0/maven-scm-manager-plexus-1.0.pom (999 B at 18 kB/s)
17:55:21 Downloading from rcptt-releases: https://repo.eclipse.org/content/repositories/rcptt-releases/org/apache/maven/scm/maven-scm-managers/1.0/maven-scm-managers-1.0.pom
17:55:21 Downloading from rcptt-snapshots: https://repo.eclipse.org/content/repositories/rcptt-snapshots/org/apache/maven/scm/maven-scm-managers/1.0/maven-scm-managers-1.0.pom
17:55:22 Downloading from central: https://repo.maven.apache.org/maven2/org/apache/maven/scm/maven-scm-managers/1.0/maven-scm-managers-1.0.pom
17:55:22 Progress (1): 1.7 kB
                    
Downloaded from central: https://repo.maven.apache.org/maven2/org/apache/maven/scm/maven-scm-managers/1.0/maven-scm-managers-1.0.pom (1.7 kB at 34 kB/s)
17:55:22 Downloading from rcptt-releases: https://repo.eclipse.org/content/repositories/rcptt-releases/org/codehaus/plexus/plexus-container-default/1.0-alpha-9/plexus-container-default-1.0-alpha-9.pom
17:55:22 Downloading from rcptt-snapshots: https://repo.eclipse.org/content/repositories/rcptt-snapshots/org/codehaus/plexus/plexus-container-default/1.0-alpha-9/plexus-container-default-1.0-alpha-9.pom
17:55:23 Downloading from central: https://repo.maven.apache.org/maven2/org/codehaus/plexus/plexus-container-default/1.0-alpha-9/plexus-container-default-1.0-alpha-9.pom
17:55:24 Progress (1): 1.2 kB
                    
Downloaded from central: https://repo.maven.apache.org/maven2/org/codehaus/plexus/plexus-container-default/1.0-alpha-9/plexus-container-default-1.0-alpha-9.pom (1.2 kB at 20 kB/s)
17:55:25 Downloading from rcptt-releases: https://repo.eclipse.org/content/repositories/rcptt-releases/org/apache/maven/scm/maven-scm-api/1.0/maven-scm-api-1.0.pom
17:55:25 Downloading from rcptt-snapshots: https://repo.eclipse.org/content/repositories/rcptt-snapshots/org/apache/maven/scm/maven-scm-api/1.0/maven-scm-api-1.0.pom
17:55:25 Downloading from central: https://repo.maven.apache.org/maven2/org/apache/maven/scm/maven-scm-api/1.0/maven-scm-api-1.0.pom
17:55:26 Progress (1): 603 B
                   
Downloaded from central: https://repo.maven.apache.org/maven2/org/apache/maven/scm/maven-scm-api/1.0/maven-scm-api-1.0.pom (603 B at 12 kB/s)
17:55:26 Downloading from rcptt-releases: https://repo.eclipse.org/content/repositories/rcptt-releases/org/codehaus/plexus/plexus-utils/1.1/plexus-utils-1.1.pom
17:55:26 Downloading from rcptt-snapshots: https://repo.eclipse.org/content/repositories/rcptt-snapshots/org/codehaus/plexus/plexus-utils/1.1/plexus-utils-1.1.pom
17:55:26 Downloading from central: https://repo.maven.apache.org/maven2/org/codehaus/plexus/plexus-utils/1.1/plexus-utils-1.1.pom
17:55:27 Progress (1): 767 B
                   
Downloaded from central: https://repo.maven.apache.org/maven2/org/codehaus/plexus/plexus-utils/1.1/plexus-utils-1.1.pom (767 B at 11 kB/s)
17:55:27 Downloading from rcptt-releases: https://repo.eclipse.org/content/repositories/rcptt-releases/org/apache/maven/scm/maven-scm-provider-bazaar/1.0/maven-scm-provider-bazaar-1.0.pom
17:55:27 Downloading from rcptt-snapshots: https://repo.eclipse.org/content/repositories/rcptt-snapshots/org/apache/maven/scm/maven-scm-provider-bazaar/1.0/maven-scm-provider-bazaar-1.0.pom
17:55:28 Downloading from central: https://repo.maven.apache.org/maven2/org/apache/maven/scm/maven-scm-provider-bazaar/1.0/maven-scm-provider-bazaar-1.0.pom
17:55:28 Progress (1): 1.1 kB
                    
Downloaded from central: https://repo.maven.apache.org/maven2/org/apache/maven/scm/maven-scm-provider-bazaar/1.0/maven-scm-provider-bazaar-1.0.pom (1.1 kB at 4.9 kB/s)
17:55:29 Downloading from rcptt-releases: https://repo.eclipse.org/content/repositories/rcptt-releases/org/apache/maven/scm/maven-scm-providers/1.0/maven-scm-providers-1.0.pom
17:55:29 Downloading from rcptt-snapshots: https://repo.eclipse.org/content/repositories/rcptt-snapshots/org/apache/maven/scm/maven-scm-providers/1.0/maven-scm-providers-1.0.pom
17:55:29 Downloading from central: https://repo.maven.apache.org/maven2/org/apache/maven/scm/maven-scm-providers/1.0/maven-scm-providers-1.0.pom
17:55:30 Progress (1): 3.3 kB
                    
Downloaded from central: https://repo.maven.apache.org/maven2/org/apache/maven/scm/maven-scm-providers/1.0/maven-scm-providers-1.0.pom (3.3 kB at 60 kB/s)
17:55:30 Downloading from rcptt-releases: https://repo.eclipse.org/content/repositories/rcptt-releases/org/codehaus/plexus/plexus-container-default/1.0-alpha-7/plexus-container-default-1.0-alpha-7.pom
17:55:30 Downloading from rcptt-snapshots: https://repo.eclipse.org/content/repositories/rcptt-snapshots/org/codehaus/plexus/plexus-container-default/1.0-alpha-7/plexus-container-default-1.0-alpha-7.pom
17:55:30 Downloading from central: https://repo.maven.apache.org/maven2/org/codehaus/plexus/plexus-container-default/1.0-alpha-7/plexus-container-default-1.0-alpha-7.pom
17:55:31 Progress (1): 1.3 kB
                    
Downloaded from central: https://repo.maven.apache.org/maven2/org/codehaus/plexus/plexus-container-default/1.0-alpha-7/plexus-container-default-1.0-alpha-7.pom (1.3 kB at 22 kB/s)
17:55:31 Downloading from rcptt-releases: https://repo.eclipse.org/content/repositories/rcptt-releases/plexus/plexus-containers/1.0.2/plexus-containers-1.0.2.pom
17:55:31 Downloading from rcptt-snapshots: https://repo.eclipse.org/content/repositories/rcptt-snapshots/plexus/plexus-containers/1.0.2/plexus-containers-1.0.2.pom
17:55:32 Downloading from central: https://repo.maven.apache.org/maven2/plexus/plexus-containers/1.0.2/plexus-containers-1.0.2.pom
17:55:32 Progress (1): 471 B
                   
Downloaded from central: https://repo.maven.apache.org/maven2/plexus/plexus-containers/1.0.2/plexus-containers-1.0.2.pom (471 B at 8.6 kB/s)
17:55:32 Downloading from rcptt-releases: https://repo.eclipse.org/content/repositories/rcptt-releases/plexus/plexus-root/1.0.3/plexus-root-1.0.3.pom
17:55:32 Downloading from rcptt-snapshots: https://repo.eclipse.org/content/repositories/rcptt-snapshots/plexus/plexus-root/1.0.3/plexus-root-1.0.3.pom
17:55:33 Downloading from central: https://repo.maven.apache.org/maven2/plexus/plexus-root/1.0.3/plexus-root-1.0.3.pom
17:55:34 Progress (1): 4.1/6.0 kB
Progress (1): 6.0 kB    
                    
Downloaded from central: https://repo.maven.apache.org/maven2/plexus/plexus-root/1.0.3/plexus-root-1.0.3.pom (6.0 kB at 107 kB/s)
17:55:34 Downloading from rcptt-releases: https://repo.eclipse.org/content/repositories/rcptt-releases/plexus/plexus-utils/1.0.2/plexus-utils-1.0.2.pom
17:55:34 Downloading from rcptt-snapshots: https://repo.eclipse.org/content/repositories/rcptt-snapshots/plexus/plexus-utils/1.0.2/plexus-utils-1.0.2.pom
17:55:34 Downloading from central: https://repo.maven.apache.org/maven2/plexus/plexus-utils/1.0.2/plexus-utils-1.0.2.pom
17:55:35 Progress (1): 740 B
                   
Downloaded from central: https://repo.maven.apache.org/maven2/plexus/plexus-utils/1.0.2/plexus-utils-1.0.2.pom (740 B at 14 kB/s)
17:55:35 Downloading from rcptt-releases: https://repo.eclipse.org/content/repositories/rcptt-releases/org/apache/maven/scm/maven-scm-provider-clearcase/1.0/maven-scm-provider-clearcase-1.0.pom
17:55:35 Downloading from rcptt-snapshots: https://repo.eclipse.org/content/repositories/rcptt-snapshots/org/apache/maven/scm/maven-scm-provider-clearcase/1.0/maven-scm-provider-clearcase-1.0.pom
17:55:36 Downloading from central: https://repo.maven.apache.org/maven2/org/apache/maven/scm/maven-scm-provider-clearcase/1.0/maven-scm-provider-clearcase-1.0.pom
17:55:36 Progress (1): 1.3 kB
                    
Downloaded from central: https://repo.maven.apache.org/maven2/org/apache/maven/scm/maven-scm-provider-clearcase/1.0/maven-scm-provider-clearcase-1.0.pom (1.3 kB at 5.4 kB/s)
17:55:36 Downloading from rcptt-releases: https://repo.eclipse.org/content/repositories/rcptt-releases/org/apache/maven/scm/maven-scm-provider-cvsexe/1.0/maven-scm-provider-cvsexe-1.0.pom
17:55:36 Downloading from rcptt-snapshots: https://repo.eclipse.org/content/repositories/rcptt-snapshots/org/apache/maven/scm/maven-scm-provider-cvsexe/1.0/maven-scm-provider-cvsexe-1.0.pom
17:55:37 Downloading from central: https://repo.maven.apache.org/maven2/org/apache/maven/scm/maven-scm-provider-cvsexe/1.0/maven-scm-provider-cvsexe-1.0.pom
17:55:38 Progress (1): 1.6 kB
                    
Downloaded from central: https://repo.maven.apache.org/maven2/org/apache/maven/scm/maven-scm-provider-cvsexe/1.0/maven-scm-provider-cvsexe-1.0.pom (1.6 kB at 6.4 kB/s)
17:55:38 Downloading from rcptt-releases: https://repo.eclipse.org/content/repositories/rcptt-releases/org/apache/maven/scm/maven-scm-providers-cvs/1.0/maven-scm-providers-cvs-1.0.pom
17:55:38 Downloading from rcptt-snapshots: https://repo.eclipse.org/content/repositories/rcptt-snapshots/org/apache/maven/scm/maven-scm-providers-cvs/1.0/maven-scm-providers-cvs-1.0.pom
17:55:39 Downloading from central: https://repo.maven.apache.org/maven2/org/apache/maven/scm/maven-scm-providers-cvs/1.0/maven-scm-providers-cvs-1.0.pom
17:55:39 Progress (1): 1.7 kB
                    
Downloaded from central: https://repo.maven.apache.org/maven2/org/apache/maven/scm/maven-scm-providers-cvs/1.0/maven-scm-providers-cvs-1.0.pom (1.7 kB at 7.1 kB/s)
17:55:39 Downloading from rcptt-releases: https://repo.eclipse.org/content/repositories/rcptt-releases/org/apache/maven/scm/maven-scm-provider-cvs-commons/1.0/maven-scm-provider-cvs-commons-1.0.pom
17:55:39 Downloading from rcptt-snapshots: https://repo.eclipse.org/content/repositories/rcptt-snapshots/org/apache/maven/scm/maven-scm-provider-cvs-commons/1.0/maven-scm-provider-cvs-commons-1.0.pom
17:55:40 Downloading from central: https://repo.maven.apache.org/maven2/org/apache/maven/scm/maven-scm-provider-cvs-commons/1.0/maven-scm-provider-cvs-commons-1.0.pom
17:55:41 Progress (1): 1.3 kB
                    
Downloaded from central: https://repo.maven.apache.org/maven2/org/apache/maven/scm/maven-scm-provider-cvs-commons/1.0/maven-scm-provider-cvs-commons-1.0.pom (1.3 kB at 4.7 kB/s)
17:55:41 Downloading from rcptt-releases: https://repo.eclipse.org/content/repositories/rcptt-releases/org/apache/maven/scm/maven-scm-provider-cvsjava/1.0/maven-scm-provider-cvsjava-1.0.pom
17:55:41 Downloading from rcptt-snapshots: https://repo.eclipse.org/content/repositories/rcptt-snapshots/org/apache/maven/scm/maven-scm-provider-cvsjava/1.0/maven-scm-provider-cvsjava-1.0.pom
17:55:42 Downloading from central: https://repo.maven.apache.org/maven2/org/apache/maven/scm/maven-scm-provider-cvsjava/1.0/maven-scm-provider-cvsjava-1.0.pom
17:55:42 Progress (1): 1.5 kB
                    
Downloaded from central: https://repo.maven.apache.org/maven2/org/apache/maven/scm/maven-scm-provider-cvsjava/1.0/maven-scm-provider-cvsjava-1.0.pom (1.5 kB at 6.6 kB/s)
17:55:42 Downloading from rcptt-releases: https://repo.eclipse.org/content/repositories/rcptt-releases/org/netbeans/lib/cvsclient/20060125/cvsclient-20060125.pom
17:55:42 Downloading from rcptt-snapshots: https://repo.eclipse.org/content/repositories/rcptt-snapshots/org/netbeans/lib/cvsclient/20060125/cvsclient-20060125.pom
17:55:43 Downloading from central: https://repo.maven.apache.org/maven2/org/netbeans/lib/cvsclient/20060125/cvsclient-20060125.pom
17:55:44 Progress (1): 459 B
                   
Downloaded from central: https://repo.maven.apache.org/maven2/org/netbeans/lib/cvsclient/20060125/cvsclient-20060125.pom (459 B at 8.7 kB/s)
17:55:44 Downloading from rcptt-releases: https://repo.eclipse.org/content/repositories/rcptt-releases/ch/ethz/ganymed/ganymed-ssh2/build210/ganymed-ssh2-build210.pom
17:55:44 Downloading from rcptt-snapshots: https://repo.eclipse.org/content/repositories/rcptt-snapshots/ch/ethz/ganymed/ganymed-ssh2/build210/ganymed-ssh2-build210.pom
17:55:44 Downloading from central: https://repo.maven.apache.org/maven2/ch/ethz/ganymed/ganymed-ssh2/build210/ganymed-ssh2-build210.pom
17:55:45 Progress (1): 710 B
                   
Downloaded from central: https://repo.maven.apache.org/maven2/ch/ethz/ganymed/ganymed-ssh2/build210/ganymed-ssh2-build210.pom (710 B at 12 kB/s)
17:55:45 Downloading from rcptt-releases: https://repo.eclipse.org/content/repositories/rcptt-releases/org/apache/maven/scm/maven-scm-provider-hg/1.0/maven-scm-provider-hg-1.0.pom
17:55:45 Downloading from rcptt-snapshots: https://repo.eclipse.org/content/repositories/rcptt-snapshots/org/apache/maven/scm/maven-scm-provider-hg/1.0/maven-scm-provider-hg-1.0.pom
17:55:46 Downloading from central: https://repo.maven.apache.org/maven2/org/apache/maven/scm/maven-scm-provider-hg/1.0/maven-scm-provider-hg-1.0.pom
17:55:46 Progress (1): 1.3 kB
                    
Downloaded from central: https://repo.maven.apache.org/maven2/org/apache/maven/scm/maven-scm-provider-hg/1.0/maven-scm-provider-hg-1.0.pom (1.3 kB at 5.8 kB/s)
17:55:46 Downloading from rcptt-releases: https://repo.eclipse.org/content/repositories/rcptt-releases/org/apache/maven/scm/maven-scm-provider-local/1.0/maven-scm-provider-local-1.0.pom
17:55:46 Downloading from rcptt-snapshots: https://repo.eclipse.org/content/repositories/rcptt-snapshots/org/apache/maven/scm/maven-scm-provider-local/1.0/maven-scm-provider-local-1.0.pom
17:55:48 Downloading from central: https://repo.maven.apache.org/maven2/org/apache/maven/scm/maven-scm-provider-local/1.0/maven-scm-provider-local-1.0.pom
17:55:49 Progress (1): 1.4 kB
                    
Downloaded from central: https://repo.maven.apache.org/maven2/org/apache/maven/scm/maven-scm-provider-local/1.0/maven-scm-provider-local-1.0.pom (1.4 kB at 5.8 kB/s)
17:55:49 Downloading from rcptt-releases: https://repo.eclipse.org/content/repositories/rcptt-releases/org/apache/maven/scm/maven-scm-provider-perforce/1.0/maven-scm-provider-perforce-1.0.pom
17:55:49 Downloading from rcptt-snapshots: https://repo.eclipse.org/content/repositories/rcptt-snapshots/org/apache/maven/scm/maven-scm-provider-perforce/1.0/maven-scm-provider-perforce-1.0.pom
17:55:49 Downloading from central: https://repo.maven.apache.org/maven2/org/apache/maven/scm/maven-scm-provider-perforce/1.0/maven-scm-provider-perforce-1.0.pom
17:55:50 Progress (1): 1.3 kB
                    
Downloaded from central: https://repo.maven.apache.org/maven2/org/apache/maven/scm/maven-scm-provider-perforce/1.0/maven-scm-provider-perforce-1.0.pom (1.3 kB at 8.4 kB/s)
17:55:50 Downloading from rcptt-releases: https://repo.eclipse.org/content/repositories/rcptt-releases/org/apache/maven/scm/maven-scm-provider-starteam/1.0/maven-scm-provider-starteam-1.0.pom
17:55:50 Downloading from rcptt-snapshots: https://repo.eclipse.org/content/repositories/rcptt-snapshots/org/apache/maven/scm/maven-scm-provider-starteam/1.0/maven-scm-provider-starteam-1.0.pom
17:55:51 Downloading from central: https://repo.maven.apache.org/maven2/org/apache/maven/scm/maven-scm-provider-starteam/1.0/maven-scm-provider-starteam-1.0.pom
17:55:51 Progress (1): 1.3 kB
                    
Downloaded from central: https://repo.maven.apache.org/maven2/org/apache/maven/scm/maven-scm-provider-starteam/1.0/maven-scm-provider-starteam-1.0.pom (1.3 kB at 5.6 kB/s)
17:55:52 Downloading from rcptt-releases: https://repo.eclipse.org/content/repositories/rcptt-releases/org/apache/maven/scm/maven-scm-provider-svnexe/1.0/maven-scm-provider-svnexe-1.0.pom
17:55:52 Downloading from rcptt-snapshots: https://repo.eclipse.org/content/repositories/rcptt-snapshots/org/apache/maven/scm/maven-scm-provider-svnexe/1.0/maven-scm-provider-svnexe-1.0.pom
17:55:52 Downloading from central: https://repo.maven.apache.org/maven2/org/apache/maven/scm/maven-scm-provider-svnexe/1.0/maven-scm-provider-svnexe-1.0.pom
17:55:53 Progress (1): 1.4 kB
                    
Downloaded from central: https://repo.maven.apache.org/maven2/org/apache/maven/scm/maven-scm-provider-svnexe/1.0/maven-scm-provider-svnexe-1.0.pom (1.4 kB at 26 kB/s)
17:55:53 Downloading from rcptt-releases: https://repo.eclipse.org/content/repositories/rcptt-releases/org/apache/maven/scm/maven-scm-providers-svn/1.0/maven-scm-providers-svn-1.0.pom
17:55:53 Downloading from rcptt-snapshots: https://repo.eclipse.org/content/repositories/rcptt-snapshots/org/apache/maven/scm/maven-scm-providers-svn/1.0/maven-scm-providers-svn-1.0.pom
17:55:57 Downloading from central: https://repo.maven.apache.org/maven2/org/apache/maven/scm/maven-scm-providers-svn/1.0/maven-scm-providers-svn-1.0.pom
17:55:58 Progress (1): 1.6 kB
                    
Downloaded from central: https://repo.maven.apache.org/maven2/org/apache/maven/scm/maven-scm-providers-svn/1.0/maven-scm-providers-svn-1.0.pom (1.6 kB at 29 kB/s)
17:55:58 Downloading from rcptt-releases: https://repo.eclipse.org/content/repositories/rcptt-releases/org/apache/maven/scm/maven-scm-provider-svn-commons/1.0/maven-scm-provider-svn-commons-1.0.pom
17:55:58 Downloading from rcptt-snapshots: https://repo.eclipse.org/content/repositories/rcptt-snapshots/org/apache/maven/scm/maven-scm-provider-svn-commons/1.0/maven-scm-provider-svn-commons-1.0.pom
17:55:58 Downloading from central: https://repo.maven.apache.org/maven2/org/apache/maven/scm/maven-scm-provider-svn-commons/1.0/maven-scm-provider-svn-commons-1.0.pom
17:55:59 Progress (1): 1.1 kB
                    
Downloaded from central: https://repo.maven.apache.org/maven2/org/apache/maven/scm/maven-scm-provider-svn-commons/1.0/maven-scm-provider-svn-commons-1.0.pom (1.1 kB at 21 kB/s)
17:55:59 Downloading from rcptt-releases: https://repo.eclipse.org/content/repositories/rcptt-releases/org/apache/maven/scm/maven-scm-provider-synergy/1.0/maven-scm-provider-synergy-1.0.pom
17:55:59 Downloading from rcptt-snapshots: https://repo.eclipse.org/content/repositories/rcptt-snapshots/org/apache/maven/scm/maven-scm-provider-synergy/1.0/maven-scm-provider-synergy-1.0.pom
17:56:00 Downloading from central: https://repo.maven.apache.org/maven2/org/apache/maven/scm/maven-scm-provider-synergy/1.0/maven-scm-provider-synergy-1.0.pom
17:56:00 Progress (1): 817 B
                   
Downloaded from central: https://repo.maven.apache.org/maven2/org/apache/maven/scm/maven-scm-provider-synergy/1.0/maven-scm-provider-synergy-1.0.pom (817 B at 2.9 kB/s)
17:56:01 Downloading from rcptt-releases: https://repo.eclipse.org/content/repositories/rcptt-releases/org/apache/maven/scm/maven-scm-provider-vss/1.0/maven-scm-provider-vss-1.0.pom
17:56:01 Downloading from rcptt-snapshots: https://repo.eclipse.org/content/repositories/rcptt-snapshots/org/apache/maven/scm/maven-scm-provider-vss/1.0/maven-scm-provider-vss-1.0.pom
17:56:01 Downloading from central: https://repo.maven.apache.org/maven2/org/apache/maven/scm/maven-scm-provider-vss/1.0/maven-scm-provider-vss-1.0.pom
17:56:02 Progress (1): 1.3 kB
                    
Downloaded from central: https://repo.maven.apache.org/maven2/org/apache/maven/scm/maven-scm-provider-vss/1.0/maven-scm-provider-vss-1.0.pom (1.3 kB at 5.8 kB/s)
17:56:02 Downloading from rcptt-releases: https://repo.eclipse.org/content/repositories/rcptt-releases/org/codehaus/plexus/plexus-utils/2.1/plexus-utils-2.1.jar
17:56:02 Downloading from rcptt-releases: https://repo.eclipse.org/content/repositories/rcptt-releases/regexp/regexp/1.3/regexp-1.3.jar
17:56:02 Downloading from rcptt-releases: https://repo.eclipse.org/content/repositories/rcptt-releases/org/apache/maven/scm/maven-scm-provider-gitexe/1.2/maven-scm-provider-gitexe-1.2.jar
17:56:02 Downloading from rcptt-releases: https://repo.eclipse.org/content/repositories/rcptt-releases/org/apache/maven/scm/maven-scm-api/1.2/maven-scm-api-1.2.jar
17:56:02 Downloading from rcptt-releases: https://repo.eclipse.org/content/repositories/rcptt-releases/org/apache/maven/scm/maven-scm-provider-git-commons/1.2/maven-scm-provider-git-commons-1.2.jar
17:56:02 Downloading from rcptt-releases: https://repo.eclipse.org/content/repositories/rcptt-releases/org/apache/maven/maven-project/2.0/maven-project-2.0.jar
17:56:03 Downloading from rcptt-releases: https://repo.eclipse.org/content/repositories/rcptt-releases/org/apache/maven/maven-profile/2.0/maven-profile-2.0.jar
17:56:03 Downloading from rcptt-releases: https://repo.eclipse.org/content/repositories/rcptt-releases/org/apache/maven/maven-model/2.0/maven-model-2.0.jar
17:56:03 Downloading from rcptt-releases: https://repo.eclipse.org/content/repositories/rcptt-releases/org/apache/maven/maven-artifact-manager/2.0/maven-artifact-manager-2.0.jar
17:56:03 Downloading from rcptt-releases: https://repo.eclipse.org/content/repositories/rcptt-releases/org/apache/maven/maven-repository-metadata/2.0/maven-repository-metadata-2.0.jar
17:56:03 Downloading from rcptt-releases: https://repo.eclipse.org/content/repositories/rcptt-releases/org/apache/maven/maven-artifact/2.0/maven-artifact-2.0.jar
17:56:03 Downloading from rcptt-releases: https://repo.eclipse.org/content/repositories/rcptt-releases/org/codehaus/plexus/plexus-container-default/1.0-alpha-8/plexus-container-default-1.0-alpha-8.jar
17:56:03 Downloading from rcptt-releases: https://repo.eclipse.org/content/repositories/rcptt-releases/org/apache/maven/maven-settings/2.0/maven-settings-2.0.jar
17:56:03 Downloading from rcptt-releases: https://repo.eclipse.org/content/repositories/rcptt-releases/org/apache/maven/maven-plugin-api/2.0/maven-plugin-api-2.0.jar
17:56:03 Downloading from rcptt-releases: https://repo.eclipse.org/content/repositories/rcptt-releases/org/apache/maven/scm/maven-scm-manager-plexus/1.0/maven-scm-manager-plexus-1.0.jar
17:56:03 Downloading from rcptt-releases: https://repo.eclipse.org/content/repositories/rcptt-releases/org/apache/maven/scm/maven-scm-provider-bazaar/1.0/maven-scm-provider-bazaar-1.0.jar
17:56:04 Downloading from rcptt-releases: https://repo.eclipse.org/content/repositories/rcptt-releases/org/apache/maven/scm/maven-scm-provider-clearcase/1.0/maven-scm-provider-clearcase-1.0.jar
17:56:04 Downloading from rcptt-releases: https://repo.eclipse.org/content/repositories/rcptt-releases/org/apache/maven/scm/maven-scm-provider-cvsexe/1.0/maven-scm-provider-cvsexe-1.0.jar
17:56:04 Downloading from rcptt-releases: https://repo.eclipse.org/content/repositories/rcptt-releases/org/apache/maven/scm/maven-scm-provider-cvs-commons/1.0/maven-scm-provider-cvs-commons-1.0.jar
17:56:04 Downloading from rcptt-releases: https://repo.eclipse.org/content/repositories/rcptt-releases/org/apache/maven/scm/maven-scm-provider-cvsjava/1.0/maven-scm-provider-cvsjava-1.0.jar
17:56:05 Downloading from rcptt-releases: https://repo.eclipse.org/content/repositories/rcptt-releases/org/netbeans/lib/cvsclient/20060125/cvsclient-20060125.jar
17:56:05 Downloading from rcptt-releases: https://repo.eclipse.org/content/repositories/rcptt-releases/ch/ethz/ganymed/ganymed-ssh2/build210/ganymed-ssh2-build210.jar
17:56:05 Downloading from rcptt-releases: https://repo.eclipse.org/content/repositories/rcptt-releases/org/apache/maven/scm/maven-scm-provider-hg/1.0/maven-scm-provider-hg-1.0.jar
17:56:05 Downloading from rcptt-releases: https://repo.eclipse.org/content/repositories/rcptt-releases/org/apache/maven/scm/maven-scm-provider-local/1.0/maven-scm-provider-local-1.0.jar
17:56:05 Downloading from rcptt-releases: https://repo.eclipse.org/content/repositories/rcptt-releases/org/apache/maven/scm/maven-scm-provider-perforce/1.0/maven-scm-provider-perforce-1.0.jar
17:56:05 Downloading from rcptt-releases: https://repo.eclipse.org/content/repositories/rcptt-releases/org/apache/maven/scm/maven-scm-provider-starteam/1.0/maven-scm-provider-starteam-1.0.jar
17:56:05 Downloading from rcptt-releases: https://repo.eclipse.org/content/repositories/rcptt-releases/org/apache/maven/scm/maven-scm-provider-svnexe/1.0/maven-scm-provider-svnexe-1.0.jar
17:56:05 Downloading from rcptt-releases: https://repo.eclipse.org/content/repositories/rcptt-releases/org/apache/maven/scm/maven-scm-provider-svn-commons/1.0/maven-scm-provider-svn-commons-1.0.jar
17:56:05 Downloading from rcptt-releases: https://repo.eclipse.org/content/repositories/rcptt-releases/org/apache/maven/scm/maven-scm-provider-synergy/1.0/maven-scm-provider-synergy-1.0.jar
17:56:05 Downloading from rcptt-releases: https://repo.eclipse.org/content/repositories/rcptt-releases/org/apache/maven/scm/maven-scm-provider-vss/1.0/maven-scm-provider-vss-1.0.jar
17:56:06 Downloading from rcptt-snapshots: https://repo.eclipse.org/content/repositories/rcptt-snapshots/org/codehaus/plexus/plexus-utils/2.1/plexus-utils-2.1.jar
17:56:06 Downloading from rcptt-snapshots: https://repo.eclipse.org/content/repositories/rcptt-snapshots/org/apache/maven/scm/maven-scm-api/1.2/maven-scm-api-1.2.jar
17:56:06 Downloading from rcptt-snapshots: https://repo.eclipse.org/content/repositories/rcptt-snapshots/org/apache/maven/scm/maven-scm-provider-git-commons/1.2/maven-scm-provider-git-commons-1.2.jar
17:56:06 Downloading from rcptt-snapshots: https://repo.eclipse.org/content/repositories/rcptt-snapshots/regexp/regexp/1.3/regexp-1.3.jar
17:56:06 Downloading from rcptt-snapshots: https://repo.eclipse.org/content/repositories/rcptt-snapshots/org/apache/maven/scm/maven-scm-provider-gitexe/1.2/maven-scm-provider-gitexe-1.2.jar
17:56:06 Downloading from rcptt-snapshots: https://repo.eclipse.org/content/repositories/rcptt-snapshots/org/apache/maven/maven-project/2.0/maven-project-2.0.jar
17:56:07 Downloading from rcptt-snapshots: https://repo.eclipse.org/content/repositories/rcptt-snapshots/org/apache/maven/maven-profile/2.0/maven-profile-2.0.jar
17:56:07 Downloading from rcptt-snapshots: https://repo.eclipse.org/content/repositories/rcptt-snapshots/org/apache/maven/maven-model/2.0/maven-model-2.0.jar
17:56:07 Downloading from rcptt-snapshots: https://repo.eclipse.org/content/repositories/rcptt-snapshots/org/apache/maven/maven-artifact-manager/2.0/maven-artifact-manager-2.0.jar
17:56:07 Downloading from rcptt-snapshots: https://repo.eclipse.org/content/repositories/rcptt-snapshots/org/apache/maven/maven-repository-metadata/2.0/maven-repository-metadata-2.0.jar
17:56:07 Downloading from rcptt-snapshots: https://repo.eclipse.org/content/repositories/rcptt-snapshots/org/apache/maven/maven-artifact/2.0/maven-artifact-2.0.jar
17:56:08 Downloading from rcptt-snapshots: https://repo.eclipse.org/content/repositories/rcptt-snapshots/org/codehaus/plexus/plexus-container-default/1.0-alpha-8/plexus-container-default-1.0-alpha-8.jar
17:56:08 Downloading from rcptt-snapshots: https://repo.eclipse.org/content/repositories/rcptt-snapshots/org/apache/maven/maven-settings/2.0/maven-settings-2.0.jar
17:56:08 Downloading from rcptt-snapshots: https://repo.eclipse.org/content/repositories/rcptt-snapshots/org/apache/maven/maven-plugin-api/2.0/maven-plugin-api-2.0.jar
17:56:08 Downloading from rcptt-snapshots: https://repo.eclipse.org/content/repositories/rcptt-snapshots/org/apache/maven/scm/maven-scm-manager-plexus/1.0/maven-scm-manager-plexus-1.0.jar
17:56:08 Downloading from rcptt-snapshots: https://repo.eclipse.org/content/repositories/rcptt-snapshots/org/apache/maven/scm/maven-scm-provider-bazaar/1.0/maven-scm-provider-bazaar-1.0.jar
17:56:08 Downloading from rcptt-snapshots: https://repo.eclipse.org/content/repositories/rcptt-snapshots/org/apache/maven/scm/maven-scm-provider-clearcase/1.0/maven-scm-provider-clearcase-1.0.jar
17:56:08 Downloading from rcptt-snapshots: https://repo.eclipse.org/content/repositories/rcptt-snapshots/org/apache/maven/scm/maven-scm-provider-cvsexe/1.0/maven-scm-provider-cvsexe-1.0.jar
17:56:08 Downloading from rcptt-snapshots: https://repo.eclipse.org/content/repositories/rcptt-snapshots/org/apache/maven/scm/maven-scm-provider-cvs-commons/1.0/maven-scm-provider-cvs-commons-1.0.jar
17:56:08 Downloading from rcptt-snapshots: https://repo.eclipse.org/content/repositories/rcptt-snapshots/org/apache/maven/scm/maven-scm-provider-cvsjava/1.0/maven-scm-provider-cvsjava-1.0.jar
17:56:08 Downloading from rcptt-snapshots: https://repo.eclipse.org/content/repositories/rcptt-snapshots/org/netbeans/lib/cvsclient/20060125/cvsclient-20060125.jar
17:56:09 Downloading from rcptt-snapshots: https://repo.eclipse.org/content/repositories/rcptt-snapshots/ch/ethz/ganymed/ganymed-ssh2/build210/ganymed-ssh2-build210.jar
17:56:09 Downloading from rcptt-snapshots: https://repo.eclipse.org/content/repositories/rcptt-snapshots/org/apache/maven/scm/maven-scm-provider-hg/1.0/maven-scm-provider-hg-1.0.jar
17:56:09 Downloading from rcptt-snapshots: https://repo.eclipse.org/content/repositories/rcptt-snapshots/org/apache/maven/scm/maven-scm-provider-local/1.0/maven-scm-provider-local-1.0.jar
17:56:09 Downloading from rcptt-snapshots: https://repo.eclipse.org/content/repositories/rcptt-snapshots/org/apache/maven/scm/maven-scm-provider-perforce/1.0/maven-scm-provider-perforce-1.0.jar
17:56:09 Downloading from rcptt-snapshots: https://repo.eclipse.org/content/repositories/rcptt-snapshots/org/apache/maven/scm/maven-scm-provider-starteam/1.0/maven-scm-provider-starteam-1.0.jar
17:56:10 Downloading from rcptt-snapshots: https://repo.eclipse.org/content/repositories/rcptt-snapshots/org/apache/maven/scm/maven-scm-provider-svnexe/1.0/maven-scm-provider-svnexe-1.0.jar
17:56:10 Downloading from rcptt-snapshots: https://repo.eclipse.org/content/repositories/rcptt-snapshots/org/apache/maven/scm/maven-scm-provider-svn-commons/1.0/maven-scm-provider-svn-commons-1.0.jar
17:56:10 Downloading from rcptt-snapshots: https://repo.eclipse.org/content/repositories/rcptt-snapshots/org/apache/maven/scm/maven-scm-provider-synergy/1.0/maven-scm-provider-synergy-1.0.jar
17:56:10 Downloading from rcptt-snapshots: https://repo.eclipse.org/content/repositories/rcptt-snapshots/org/apache/maven/scm/maven-scm-provider-vss/1.0/maven-scm-provider-vss-1.0.jar
17:56:10 Downloading from central: https://repo.maven.apache.org/maven2/org/codehaus/plexus/plexus-utils/2.1/plexus-utils-2.1.jar
17:56:10 Downloading from central: https://repo.maven.apache.org/maven2/org/apache/maven/scm/maven-scm-api/1.2/maven-scm-api-1.2.jar
17:56:10 Downloading from central: https://repo.maven.apache.org/maven2/org/apache/maven/scm/maven-scm-provider-git-commons/1.2/maven-scm-provider-git-commons-1.2.jar
17:56:10 Downloading from central: https://repo.maven.apache.org/maven2/regexp/regexp/1.3/regexp-1.3.jar
17:56:10 Downloading from central: https://repo.maven.apache.org/maven2/org/apache/maven/scm/maven-scm-provider-gitexe/1.2/maven-scm-provider-gitexe-1.2.jar
17:56:10 Progress (1): 4.1/84 kB
Progress (1): 8.2/84 kB
Progress (1): 12/84 kB 
Progress (1): 16/84 kB
Progress (1): 20/84 kB
Progress (1): 25/84 kB
Progress (1): 29/84 kB
Progress (1): 33/84 kB
Progress (1): 37/84 kB
Progress (1): 41/84 kB
Progress (1): 45/84 kB
Progress (1): 49/84 kB
Progress (1): 53/84 kB
Progress (1): 57/84 kB
Progress (1): 61/84 kB
Progress (1): 66/84 kB
Progress (1): 70/84 kB
Progress (1): 74/84 kB
Progress (1): 78/84 kB
Progress (1): 82/84 kB
Progress (1): 84 kB   
Progress (2): 84 kB | 4.1/48 kB
Progress (2): 84 kB | 8.2/48 kB
Progress (2): 84 kB | 12/48 kB 
Progress (2): 84 kB | 16/48 kB
Progress (3): 84 kB | 16/48 kB | 4.1/25 kB
Progress (3): 84 kB | 16/48 kB | 8.2/25 kB
Progress (3): 84 kB | 16/48 kB | 12/25 kB 
Progress (3): 84 kB | 16/48 kB | 16/25 kB
Progress (3): 84 kB | 16/48 kB | 20/25 kB
Progress (3): 84 kB | 16/48 kB | 25/25 kB
Progress (3): 84 kB | 16/48 kB | 25 kB   
Progress (4): 84 kB | 16/48 kB | 25 kB | 4.1/225 kB
Progress (4): 84 kB | 16/48 kB | 25 kB | 8.2/225 kB
Progress (4): 84 kB | 16/48 kB | 25 kB | 12/225 kB 
Progress (4): 84 kB | 16/48 kB | 25 kB | 16/225 kB
Progress (4): 84 kB | 16/48 kB | 25 kB | 20/225 kB
Progress (4): 84 kB | 16/48 kB | 25 kB | 25/225 kB
Progress (4): 84 kB | 16/48 kB | 25 kB | 29/225 kB
Progress (4): 84 kB | 16/48 kB | 25 kB | 33/225 kB
Progress (4): 84 kB | 20/48 kB | 25 kB | 33/225 kB
Progress (4): 84 kB | 20/48 kB | 25 kB | 37/225 kB
Progress (4): 84 kB | 25/48 kB | 25 kB | 37/225 kB
Progress (4): 84 kB | 25/48 kB | 25 kB | 41/225 kB
Progress (4): 84 kB | 25/48 kB | 25 kB | 45/225 kB
Progress (4): 84 kB | 25/48 kB | 25 kB | 49/225 kB
Progress (4): 84 kB | 29/48 kB | 25 kB | 49/225 kB
Progress (4): 84 kB | 33/48 kB | 25 kB | 49/225 kB
Progress (4): 84 kB | 33/48 kB | 25 kB | 53/225 kB
Progress (4): 84 kB | 33/48 kB | 25 kB | 57/225 kB
Progress (4): 84 kB | 33/48 kB | 25 kB | 61/225 kB
Progress (4): 84 kB | 33/48 kB | 25 kB | 66/225 kB
Progress (4): 84 kB | 33/48 kB | 25 kB | 70/225 kB
Progress (4): 84 kB | 37/48 kB | 25 kB | 70/225 kB
Progress (4): 84 kB | 37/48 kB | 25 kB | 74/225 kB
Progress (4): 84 kB | 41/48 kB | 25 kB | 74/225 kB
Progress (4): 84 kB | 41/48 kB | 25 kB | 78/225 kB
Progress (4): 84 kB | 45/48 kB | 25 kB | 78/225 kB
Progress (4): 84 kB | 45/48 kB | 25 kB | 82/225 kB
Progress (4): 84 kB | 48 kB | 25 kB | 82/225 kB   
Progress (4): 84 kB | 48 kB | 25 kB | 86/225 kB
Progress (4): 84 kB | 48 kB | 25 kB | 90/225 kB
Progress (4): 84 kB | 48 kB | 25 kB | 94/225 kB
Progress (4): 84 kB | 48 kB | 25 kB | 98/225 kB
Progress (4): 84 kB | 48 kB | 25 kB | 102/225 kB
Progress (4): 84 kB | 48 kB | 25 kB | 106/225 kB
Progress (4): 84 kB | 48 kB | 25 kB | 111/225 kB
Progress (4): 84 kB | 48 kB | 25 kB | 115/225 kB
Progress (4): 84 kB | 48 kB | 25 kB | 119/225 kB
Progress (4): 84 kB | 48 kB | 25 kB | 123/225 kB
Progress (4): 84 kB | 48 kB | 25 kB | 127/225 kB
Progress (4): 84 kB | 48 kB | 25 kB | 131/225 kB
Progress (4): 84 kB | 48 kB | 25 kB | 135/225 kB
Progress (4): 84 kB | 48 kB | 25 kB | 139/225 kB
Progress (4): 84 kB | 48 kB | 25 kB | 143/225 kB
Progress (4): 84 kB | 48 kB | 25 kB | 147/225 kB
Progress (4): 84 kB | 48 kB | 25 kB | 152/225 kB
Progress (4): 84 kB | 48 kB | 25 kB | 156/225 kB
Progress (4): 84 kB | 48 kB | 25 kB | 160/225 kB
Progress (4): 84 kB | 48 kB | 25 kB | 164/225 kB
Progress (4): 84 kB | 48 kB | 25 kB | 168/225 kB
Progress (4): 84 kB | 48 kB | 25 kB | 172/225 kB
Progress (4): 84 kB | 48 kB | 25 kB | 176/225 kB
Progress (4): 84 kB | 48 kB | 25 kB | 180/225 kB
Progress (4): 84 kB | 48 kB | 25 kB | 184/225 kB
Progress (4): 84 kB | 48 kB | 25 kB | 188/225 kB
Progress (4): 84 kB | 48 kB | 25 kB | 193/225 kB
Progress (4): 84 kB | 48 kB | 25 kB | 197/225 kB
Progress (4): 84 kB | 48 kB | 25 kB | 201/225 kB
Progress (4): 84 kB | 48 kB | 25 kB | 205/225 kB
Progress (4): 84 kB | 48 kB | 25 kB | 209/225 kB
Progress (4): 84 kB | 48 kB | 25 kB | 213/225 kB
Progress (4): 84 kB | 48 kB | 25 kB | 217/225 kB
Progress (4): 84 kB | 48 kB | 25 kB | 221/225 kB
Progress (4): 84 kB | 48 kB | 25 kB | 225 kB    
                                            
Downloaded from central: https://repo.maven.apache.org/maven2/org/apache/maven/scm/maven-scm-api/1.2/maven-scm-api-1.2.jar (84 kB at 959 kB/s)
17:56:10 Downloading from central: https://repo.maven.apache.org/maven2/org/apache/maven/maven-project/2.0/maven-project-2.0.jar
17:56:10 Downloaded from central: https://repo.maven.apache.org/maven2/regexp/regexp/1.3/regexp-1.3.jar (25 kB at 276 kB/s)
17:56:10 Downloading from central: https://repo.maven.apache.org/maven2/org/apache/maven/maven-profile/2.0/maven-profile-2.0.jar
17:56:10 Downloaded from central: https://repo.maven.apache.org/maven2/org/apache/maven/scm/maven-scm-provider-gitexe/1.2/maven-scm-provider-gitexe-1.2.jar (48 kB at 476 kB/s)
17:56:10 Downloading from central: https://repo.maven.apache.org/maven2/org/apache/maven/maven-model/2.0/maven-model-2.0.jar
17:56:10 Downloaded from central: https://repo.maven.apache.org/maven2/org/codehaus/plexus/plexus-utils/2.1/plexus-utils-2.1.jar (225 kB at 2.0 MB/s)
17:56:10 Downloading from central: https://repo.maven.apache.org/maven2/org/apache/maven/maven-artifact-manager/2.0/maven-artifact-manager-2.0.jar
17:56:10 Progress (1): 4.1/105 kB
Progress (1): 8.2/105 kB
Progress (1): 12/105 kB 
Progress (1): 16/105 kB
Progress (1): 20/105 kB
Progress (1): 25/105 kB
Progress (1): 29/105 kB
Progress (1): 33/105 kB
Progress (1): 37/105 kB
Progress (1): 41/105 kB
Progress (1): 45/105 kB
Progress (1): 49/105 kB
Progress (1): 53/105 kB
Progress (1): 57/105 kB
Progress (1): 61/105 kB
Progress (1): 66/105 kB
Progress (2): 66/105 kB | 4.1/30 kB
Progress (2): 66/105 kB | 8.2/30 kB
Progress (2): 66/105 kB | 12/30 kB 
Progress (2): 66/105 kB | 16/30 kB
Progress (2): 70/105 kB | 16/30 kB
Progress (2): 74/105 kB | 16/30 kB
Progress (2): 78/105 kB | 16/30 kB
Progress (2): 82/105 kB | 16/30 kB
Progress (2): 86/105 kB | 16/30 kB
Progress (2): 90/105 kB | 16/30 kB
Progress (2): 94/105 kB | 16/30 kB
Progress (2): 98/105 kB | 16/30 kB
Progress (2): 98/105 kB | 20/30 kB
Progress (2): 98/105 kB | 25/30 kB
Progress (2): 98/105 kB | 29/30 kB
Progress (2): 98/105 kB | 30 kB   
Progress (2): 102/105 kB | 30 kB
Progress (2): 105 kB | 30 kB    
Progress (3): 105 kB | 30 kB | 4.1/78 kB
Progress (3): 105 kB | 30 kB | 8.2/78 kB
Progress (3): 105 kB | 30 kB | 12/78 kB 
Progress (3): 105 kB | 30 kB | 16/78 kB
Progress (3): 105 kB | 30 kB | 20/78 kB
Progress (3): 105 kB | 30 kB | 25/78 kB
Progress (3): 105 kB | 30 kB | 29/78 kB
Progress (3): 105 kB | 30 kB | 33/78 kB
Progress (4): 105 kB | 30 kB | 33/78 kB | 4.1/35 kB
Progress (4): 105 kB | 30 kB | 33/78 kB | 8.2/35 kB
Progress (4): 105 kB | 30 kB | 33/78 kB | 12/35 kB 
Progress (4): 105 kB | 30 kB | 33/78 kB | 16/35 kB
Progress (4): 105 kB | 30 kB | 33/78 kB | 20/35 kB
Progress (4): 105 kB | 30 kB | 33/78 kB | 25/35 kB
Progress (4): 105 kB | 30 kB | 33/78 kB | 29/35 kB
Progress (4): 105 kB | 30 kB | 33/78 kB | 33/35 kB
Progress (4): 105 kB | 30 kB | 33/78 kB | 35 kB   
Progress (5): 105 kB | 30 kB | 33/78 kB | 35 kB | 4.1/51 kB
Progress (5): 105 kB | 30 kB | 33/78 kB | 35 kB | 8.2/51 kB
Progress (5): 105 kB | 30 kB | 37/78 kB | 35 kB | 8.2/51 kB
Progress (5): 105 kB | 30 kB | 37/78 kB | 35 kB | 12/51 kB 
Progress (5): 105 kB | 30 kB | 41/78 kB | 35 kB | 12/51 kB
Progress (5): 105 kB | 30 kB | 41/78 kB | 35 kB | 16/51 kB
Progress (5): 105 kB | 30 kB | 45/78 kB | 35 kB | 16/51 kB
Progress (5): 105 kB | 30 kB | 49/78 kB | 35 kB | 16/51 kB
Progress (5): 105 kB | 30 kB | 49/78 kB | 35 kB | 20/51 kB
Progress (5): 105 kB | 30 kB | 49/78 kB | 35 kB | 25/51 kB
Progress (5): 105 kB | 30 kB | 49/78 kB | 35 kB | 29/51 kB
Progress (5): 105 kB | 30 kB | 49/78 kB | 35 kB | 33/51 kB
Progress (5): 105 kB | 30 kB | 49/78 kB | 35 kB | 37/51 kB
Progress (5): 105 kB | 30 kB | 53/78 kB | 35 kB | 37/51 kB
Progress (5): 105 kB | 30 kB | 53/78 kB | 35 kB | 41/51 kB
Progress (5): 105 kB | 30 kB | 57/78 kB | 35 kB | 41/51 kB
Progress (5): 105 kB | 30 kB | 61/78 kB | 35 kB | 41/51 kB
Progress (5): 105 kB | 30 kB | 61/78 kB | 35 kB | 45/51 kB
Progress (5): 105 kB | 30 kB | 61/78 kB | 35 kB | 49/51 kB
Progress (5): 105 kB | 30 kB | 61/78 kB | 35 kB | 51 kB   
Progress (5): 105 kB | 30 kB | 66/78 kB | 35 kB | 51 kB
Progress (5): 105 kB | 30 kB | 70/78 kB | 35 kB | 51 kB
Progress (5): 105 kB | 30 kB | 74/78 kB | 35 kB | 51 kB
Progress (5): 105 kB | 30 kB | 78/78 kB | 35 kB | 51 kB
Progress (5): 105 kB | 30 kB | 78 kB | 35 kB | 51 kB   
                                                    
Downloaded from central: https://repo.maven.apache.org/maven2/org/apache/maven/maven-project/2.0/maven-project-2.0.jar (105 kB at 688 kB/s)
17:56:11 Downloading from central: https://repo.maven.apache.org/maven2/org/apache/maven/maven-repository-metadata/2.0/maven-repository-metadata-2.0.jar
17:56:11 Downloaded from central: https://repo.maven.apache.org/maven2/org/apache/maven/maven-profile/2.0/maven-profile-2.0.jar (30 kB at 195 kB/s)
17:56:11 Downloading from central: https://repo.maven.apache.org/maven2/org/apache/maven/maven-artifact/2.0/maven-artifact-2.0.jar
17:56:11 Downloaded from central: https://repo.maven.apache.org/maven2/org/apache/maven/scm/maven-scm-provider-git-commons/1.2/maven-scm-provider-git-commons-1.2.jar (35 kB at 217 kB/s)
17:56:11 Downloading from central: https://repo.maven.apache.org/maven2/org/codehaus/plexus/plexus-container-default/1.0-alpha-8/plexus-container-default-1.0-alpha-8.jar
17:56:11 Downloaded from central: https://repo.maven.apache.org/maven2/org/apache/maven/maven-artifact-manager/2.0/maven-artifact-manager-2.0.jar (51 kB at 301 kB/s)
17:56:11 Downloading from central: https://repo.maven.apache.org/maven2/org/apache/maven/maven-settings/2.0/maven-settings-2.0.jar
17:56:11 Downloaded from central: https://repo.maven.apache.org/maven2/org/apache/maven/maven-model/2.0/maven-model-2.0.jar (78 kB at 451 kB/s)
17:56:11 Downloading from central: https://repo.maven.apache.org/maven2/org/apache/maven/maven-plugin-api/2.0/maven-plugin-api-2.0.jar
17:56:11 Progress (1): 4.1/21 kB
Progress (1): 8.2/21 kB
Progress (1): 12/21 kB 
Progress (1): 16/21 kB
Progress (1): 20/21 kB
Progress (1): 21 kB   
Progress (2): 21 kB | 4.1/79 kB
Progress (2): 21 kB | 8.2/79 kB
Progress (2): 21 kB | 12/79 kB 
Progress (2): 21 kB | 16/79 kB
Progress (2): 21 kB | 20/79 kB
Progress (2): 21 kB | 25/79 kB
Progress (2): 21 kB | 29/79 kB
Progress (2): 21 kB | 33/79 kB
Progress (2): 21 kB | 37/79 kB
Progress (2): 21 kB | 41/79 kB
Progress (2): 21 kB | 45/79 kB
Progress (2): 21 kB | 49/79 kB
Progress (2): 21 kB | 53/79 kB
Progress (2): 21 kB | 57/79 kB
Progress (2): 21 kB | 61/79 kB
Progress (2): 21 kB | 66/79 kB
Progress (2): 21 kB | 70/79 kB
Progress (2): 21 kB | 74/79 kB
Progress (2): 21 kB | 78/79 kB
Progress (2): 21 kB | 79 kB   
Progress (3): 21 kB | 79 kB | 4.1/195 kB
Progress (3): 21 kB | 79 kB | 8.2/195 kB
Progress (3): 21 kB | 79 kB | 12/195 kB 
Progress (3): 21 kB | 79 kB | 16/195 kB
Progress (3): 21 kB | 79 kB | 20/195 kB
Progress (3): 21 kB | 79 kB | 25/195 kB
Progress (3): 21 kB | 79 kB | 29/195 kB
Progress (3): 21 kB | 79 kB | 33/195 kB
Progress (3): 21 kB | 79 kB | 37/195 kB
Progress (3): 21 kB | 79 kB | 41/195 kB
Progress (3): 21 kB | 79 kB | 45/195 kB
Progress (3): 21 kB | 79 kB | 49/195 kB
Progress (3): 21 kB | 79 kB | 53/195 kB
Progress (3): 21 kB | 79 kB | 57/195 kB
Progress (3): 21 kB | 79 kB | 61/195 kB
Progress (3): 21 kB | 79 kB | 66/195 kB
Progress (3): 21 kB | 79 kB | 70/195 kB
Progress (3): 21 kB | 79 kB | 74/195 kB
Progress (3): 21 kB | 79 kB | 78/195 kB
Progress (3): 21 kB | 79 kB | 82/195 kB
Progress (3): 21 kB | 79 kB | 86/195 kB
Progress (3): 21 kB | 79 kB | 90/195 kB
Progress (3): 21 kB | 79 kB | 94/195 kB
Progress (3): 21 kB | 79 kB | 98/195 kB
Progress (3): 21 kB | 79 kB | 102/195 kB
Progress (3): 21 kB | 79 kB | 106/195 kB
Progress (3): 21 kB | 79 kB | 111/195 kB
Progress (3): 21 kB | 79 kB | 115/195 kB
Progress (3): 21 kB | 79 kB | 119/195 kB
Progress (3): 21 kB | 79 kB | 123/195 kB
Progress (3): 21 kB | 79 kB | 127/195 kB
Progress (4): 21 kB | 79 kB | 127/195 kB | 4.1/43 kB
Progress (4): 21 kB | 79 kB | 131/195 kB | 4.1/43 kB
Progress (4): 21 kB | 79 kB | 131/195 kB | 8.2/43 kB
Progress (4): 21 kB | 79 kB | 131/195 kB | 12/43 kB 
Progress (4): 21 kB | 79 kB | 131/195 kB | 16/43 kB
Progress (4): 21 kB | 79 kB | 135/195 kB | 16/43 kB
Progress (4): 21 kB | 79 kB | 139/195 kB | 16/43 kB
Progress (4): 21 kB | 79 kB | 143/195 kB | 16/43 kB
Progress (4): 21 kB | 79 kB | 147/195 kB | 16/43 kB
Progress (4): 21 kB | 79 kB | 147/195 kB | 20/43 kB
Progress (4): 21 kB | 79 kB | 152/195 kB | 20/43 kB
Progress (4): 21 kB | 79 kB | 152/195 kB | 25/43 kB
Progress (4): 21 kB | 79 kB | 156/195 kB | 25/43 kB
Progress (4): 21 kB | 79 kB | 160/195 kB | 25/43 kB
Progress (4): 21 kB | 79 kB | 164/195 kB | 25/43 kB
Progress (4): 21 kB | 79 kB | 168/195 kB | 25/43 kB
Progress (5): 21 kB | 79 kB | 168/195 kB | 25/43 kB | 4.1/10 kB
Progress (5): 21 kB | 79 kB | 168/195 kB | 29/43 kB | 4.1/10 kB
Progress (5): 21 kB | 79 kB | 172/195 kB | 29/43 kB | 4.1/10 kB
Progress (5): 21 kB | 79 kB | 172/195 kB | 29/43 kB | 8.2/10 kB
Progress (5): 21 kB | 79 kB | 172/195 kB | 33/43 kB | 8.2/10 kB
Progress (5): 21 kB | 79 kB | 172/195 kB | 33/43 kB | 10 kB    
Progress (5): 21 kB | 79 kB | 176/195 kB | 33/43 kB | 10 kB
Progress (5): 21 kB | 79 kB | 176/195 kB | 37/43 kB | 10 kB
Progress (5): 21 kB | 79 kB | 180/195 kB | 37/43 kB | 10 kB
Progress (5): 21 kB | 79 kB | 180/195 kB | 41/43 kB | 10 kB
Progress (5): 21 kB | 79 kB | 180/195 kB | 43 kB | 10 kB   
Progress (5): 21 kB | 79 kB | 184/195 kB | 43 kB | 10 kB
Progress (5): 21 kB | 79 kB | 188/195 kB | 43 kB | 10 kB
Progress (5): 21 kB | 79 kB | 193/195 kB | 43 kB | 10 kB
Progress (5): 21 kB | 79 kB | 195 kB | 43 kB | 10 kB    
                                                    
Downloaded from central: https://repo.maven.apache.org/maven2/org/apache/maven/maven-repository-metadata/2.0/maven-repository-metadata-2.0.jar (21 kB at 95 kB/s)
17:56:11 Downloading from central: https://repo.maven.apache.org/maven2/org/apache/maven/scm/maven-scm-manager-plexus/1.0/maven-scm-manager-plexus-1.0.jar
17:56:11 Downloaded from central: https://repo.maven.apache.org/maven2/org/apache/maven/maven-artifact/2.0/maven-artifact-2.0.jar (79 kB at 353 kB/s)
17:56:11 Downloading from central: https://repo.maven.apache.org/maven2/org/apache/maven/scm/maven-scm-provider-bazaar/1.0/maven-scm-provider-bazaar-1.0.jar
17:56:11 Progress (4): 195 kB | 43 kB | 10 kB | 4.1/9.9 kB
Progress (4): 195 kB | 43 kB | 10 kB | 8.2/9.9 kB
Progress (4): 195 kB | 43 kB | 10 kB | 9.9 kB    
                                             
Downloaded from central: https://repo.maven.apache.org/maven2/org/apache/maven/maven-settings/2.0/maven-settings-2.0.jar (43 kB at 175 kB/s)
17:56:11 Downloaded from central: https://repo.maven.apache.org/maven2/org/codehaus/plexus/plexus-container-default/1.0-alpha-8/plexus-container-default-1.0-alpha-8.jar (195 kB at 791 kB/s)
17:56:11 Downloading from central: https://repo.maven.apache.org/maven2/org/apache/maven/scm/maven-scm-provider-clearcase/1.0/maven-scm-provider-clearcase-1.0.jar
17:56:11 Downloading from central: https://repo.maven.apache.org/maven2/org/apache/maven/scm/maven-scm-provider-cvsexe/1.0/maven-scm-provider-cvsexe-1.0.jar
17:56:11 Downloaded from central: https://repo.maven.apache.org/maven2/org/apache/maven/maven-plugin-api/2.0/maven-plugin-api-2.0.jar (10 kB at 41 kB/s)
17:56:11 Progress (2): 9.9 kB | 4.1/47 kB
                                
Downloading from central: https://repo.maven.apache.org/maven2/org/apache/maven/scm/maven-scm-provider-cvs-commons/1.0/maven-scm-provider-cvs-commons-1.0.jar
17:56:11 Progress (2): 9.9 kB | 8.2/47 kB
Progress (2): 9.9 kB | 12/47 kB 
Progress (2): 9.9 kB | 16/47 kB
Progress (2): 9.9 kB | 20/47 kB
Progress (2): 9.9 kB | 25/47 kB
Progress (2): 9.9 kB | 29/47 kB
Progress (2): 9.9 kB | 33/47 kB
Progress (2): 9.9 kB | 37/47 kB
Progress (2): 9.9 kB | 41/47 kB
Progress (2): 9.9 kB | 45/47 kB
Progress (2): 9.9 kB | 47 kB   
                            
Downloaded from central: https://repo.maven.apache.org/maven2/org/apache/maven/scm/maven-scm-manager-plexus/1.0/maven-scm-manager-plexus-1.0.jar (9.9 kB at 36 kB/s)
17:56:11 Downloading from central: https://repo.maven.apache.org/maven2/org/apache/maven/scm/maven-scm-provider-cvsjava/1.0/maven-scm-provider-cvsjava-1.0.jar
17:56:11 Progress (2): 47 kB | 4.1/68 kB
                               
Downloaded from central: https://repo.maven.apache.org/maven2/org/apache/maven/scm/maven-scm-provider-bazaar/1.0/maven-scm-provider-bazaar-1.0.jar (47 kB at 160 kB/s)
17:56:11 Progress (1): 8.2/68 kB
                       
Downloading from central: https://repo.maven.apache.org/maven2/org/netbeans/lib/cvsclient/20060125/cvsclient-20060125.jar
17:56:11 Progress (1): 12/68 kB
Progress (1): 16/68 kB
Progress (1): 20/68 kB
Progress (1): 25/68 kB
Progress (1): 29/68 kB
Progress (1): 33/68 kB
Progress (1): 37/68 kB
Progress (1): 41/68 kB
Progress (1): 45/68 kB
Progress (1): 49/68 kB
Progress (1): 53/68 kB
Progress (1): 57/68 kB
Progress (1): 61/68 kB
Progress (1): 66/68 kB
Progress (1): 68 kB   
Progress (2): 68 kB | 4.1/40 kB
Progress (2): 68 kB | 8.2/40 kB
Progress (2): 68 kB | 12/40 kB 
Progress (2): 68 kB | 16/40 kB
Progress (2): 68 kB | 20/40 kB
Progress (2): 68 kB | 25/40 kB
Progress (2): 68 kB | 29/40 kB
Progress (2): 68 kB | 33/40 kB
Progress (2): 68 kB | 37/40 kB
Progress (2): 68 kB | 40 kB   
Progress (3): 68 kB | 40 kB | 4.1/619 kB
Progress (3): 68 kB | 40 kB | 8.2/619 kB
Progress (3): 68 kB | 40 kB | 12/619 kB 
Progress (3): 68 kB | 40 kB | 16/619 kB
                                       
Downloaded from central: https://repo.maven.apache.org/maven2/org/apache/maven/scm/maven-scm-provider-cvs-commons/1.0/maven-scm-provider-cvs-commons-1.0.jar (68 kB at 210 kB/s)
17:56:11 Progress (2): 40 kB | 20/619 kB
                               
Downloading from central: https://repo.maven.apache.org/maven2/ch/ethz/ganymed/ganymed-ssh2/build210/ganymed-ssh2-build210.jar
17:56:11 Progress (2): 40 kB | 25/619 kB
Progress (2): 40 kB | 29/619 kB
Progress (2): 40 kB | 33/619 kB
Progress (2): 40 kB | 37/619 kB
Progress (2): 40 kB | 41/619 kB
Progress (2): 40 kB | 45/619 kB
Progress (2): 40 kB | 49/619 kB
Progress (2): 40 kB | 53/619 kB
Progress (2): 40 kB | 57/619 kB
Progress (2): 40 kB | 61/619 kB
Progress (2): 40 kB | 66/619 kB
Progress (2): 40 kB | 70/619 kB
Progress (2): 40 kB | 74/619 kB
Progress (2): 40 kB | 78/619 kB
Progress (2): 40 kB | 82/619 kB
Progress (2): 40 kB | 86/619 kB
Progress (2): 40 kB | 90/619 kB
Progress (2): 40 kB | 94/619 kB
Progress (2): 40 kB | 98/619 kB
Progress (2): 40 kB | 102/619 kB
Progress (2): 40 kB | 106/619 kB
Progress (2): 40 kB | 111/619 kB
Progress (2): 40 kB | 115/619 kB
Progress (2): 40 kB | 119/619 kB
Progress (2): 40 kB | 123/619 kB
Progress (2): 40 kB | 127/619 kB
Progress (2): 40 kB | 131/619 kB
Progress (2): 40 kB | 135/619 kB
Progress (2): 40 kB | 139/619 kB
Progress (2): 40 kB | 143/619 kB
Progress (2): 40 kB | 147/619 kB
Progress (2): 40 kB | 152/619 kB
Progress (2): 40 kB | 156/619 kB
Progress (2): 40 kB | 160/619 kB
Progress (2): 40 kB | 164/619 kB
Progress (2): 40 kB | 168/619 kB
Progress (2): 40 kB | 172/619 kB
Progress (2): 40 kB | 176/619 kB
Progress (2): 40 kB | 180/619 kB
Progress (2): 40 kB | 184/619 kB
Progress (2): 40 kB | 188/619 kB
Progress (2): 40 kB | 193/619 kB
Progress (2): 40 kB | 197/619 kB
Progress (2): 40 kB | 201/619 kB
Progress (2): 40 kB | 205/619 kB
Progress (2): 40 kB | 209/619 kB
Progress (2): 40 kB | 213/619 kB
Progress (2): 40 kB | 217/619 kB
Progress (2): 40 kB | 221/619 kB
Progress (2): 40 kB | 225/619 kB
Progress (2): 40 kB | 229/619 kB
Progress (2): 40 kB | 233/619 kB
Progress (2): 40 kB | 238/619 kB
Progress (2): 40 kB | 242/619 kB
Progress (2): 40 kB | 246/619 kB
Progress (2): 40 kB | 250/619 kB
Progress (2): 40 kB | 254/619 kB
Progress (2): 40 kB | 255/619 kB
Progress (2): 40 kB | 259/619 kB
Progress (2): 40 kB | 263/619 kB
Progress (2): 40 kB | 268/619 kB
Progress (2): 40 kB | 272/619 kB
Progress (2): 40 kB | 276/619 kB
                                
Downloaded from central: https://repo.maven.apache.org/maven2/org/apache/maven/scm/maven-scm-provider-cvsjava/1.0/maven-scm-provider-cvsjava-1.0.jar (40 kB at 115 kB/s)
17:56:11 Progress (1): 280/619 kB
                        
Downloading from central: https://repo.maven.apache.org/maven2/org/apache/maven/scm/maven-scm-provider-hg/1.0/maven-scm-provider-hg-1.0.jar
17:56:11 Progress (1): 284/619 kB
Progress (1): 288/619 kB
Progress (1): 292/619 kB
Progress (1): 296/619 kB
Progress (1): 300/619 kB
Progress (1): 304/619 kB
Progress (1): 309/619 kB
Progress (1): 313/619 kB
Progress (1): 317/619 kB
Progress (1): 321/619 kB
Progress (1): 325/619 kB
Progress (1): 329/619 kB
Progress (1): 333/619 kB
Progress (1): 337/619 kB
Progress (1): 341/619 kB
Progress (1): 345/619 kB
Progress (1): 349/619 kB
Progress (1): 354/619 kB
Progress (1): 358/619 kB
Progress (1): 362/619 kB
Progress (1): 366/619 kB
Progress (1): 370/619 kB
Progress (1): 374/619 kB
Progress (1): 378/619 kB
Progress (1): 382/619 kB
Progress (1): 386/619 kB
Progress (1): 390/619 kB
Progress (1): 395/619 kB
Progress (1): 399/619 kB
Progress (1): 403/619 kB
Progress (1): 407/619 kB
Progress (1): 411/619 kB
Progress (1): 415/619 kB
Progress (1): 419/619 kB
Progress (1): 423/619 kB
Progress (1): 427/619 kB
Progress (1): 431/619 kB
Progress (1): 435/619 kB
Progress (2): 435/619 kB | 4.1/245 kB
Progress (2): 435/619 kB | 8.2/245 kB
Progress (2): 435/619 kB | 12/245 kB 
Progress (2): 435/619 kB | 16/245 kB
Progress (2): 435/619 kB | 20/245 kB
Progress (2): 435/619 kB | 25/245 kB
Progress (2): 440/619 kB | 25/245 kB
Progress (2): 440/619 kB | 29/245 kB
Progress (2): 444/619 kB | 29/245 kB
Progress (2): 444/619 kB | 33/245 kB
Progress (2): 448/619 kB | 33/245 kB
Progress (2): 452/619 kB | 33/245 kB
Progress (2): 452/619 kB | 37/245 kB
Progress (2): 452/619 kB | 41/245 kB
Progress (2): 452/619 kB | 45/245 kB
Progress (2): 452/619 kB | 49/245 kB
Progress (2): 452/619 kB | 53/245 kB
Progress (2): 452/619 kB | 57/245 kB
Progress (2): 452/619 kB | 61/245 kB
Progress (2): 452/619 kB | 66/245 kB
Progress (2): 452/619 kB | 70/245 kB
Progress (2): 452/619 kB | 74/245 kB
Progress (2): 452/619 kB | 78/245 kB
Progress (2): 452/619 kB | 82/245 kB
Progress (2): 452/619 kB | 86/245 kB
Progress (2): 452/619 kB | 90/245 kB
Progress (2): 456/619 kB | 90/245 kB
Progress (2): 456/619 kB | 94/245 kB
Progress (2): 460/619 kB | 94/245 kB
Progress (2): 460/619 kB | 98/245 kB
Progress (2): 464/619 kB | 98/245 kB
Progress (2): 468/619 kB | 98/245 kB
Progress (2): 472/619 kB | 98/245 kB
Progress (2): 475/619 kB | 98/245 kB
Progress (2): 475/619 kB | 102/245 kB
Progress (2): 475/619 kB | 106/245 kB
Progress (2): 475/619 kB | 111/245 kB
Progress (2): 475/619 kB | 115/245 kB
Progress (2): 475/619 kB | 119/245 kB
Progress (2): 475/619 kB | 123/245 kB
Progress (2): 475/619 kB | 127/245 kB
Progress (2): 475/619 kB | 131/245 kB
Progress (2): 475/619 kB | 135/245 kB
Progress (2): 475/619 kB | 139/245 kB
Progress (2): 479/619 kB | 139/245 kB
Progress (2): 479/619 kB | 143/245 kB
Progress (2): 483/619 kB | 143/245 kB
Progress (2): 483/619 kB | 147/245 kB
Progress (2): 487/619 kB | 147/245 kB
Progress (2): 491/619 kB | 147/245 kB
Progress (2): 491/619 kB | 152/245 kB
Progress (2): 491/619 kB | 156/245 kB
Progress (2): 491/619 kB | 160/245 kB
Progress (2): 491/619 kB | 164/245 kB
Progress (2): 491/619 kB | 168/245 kB
Progress (2): 491/619 kB | 172/245 kB
Progress (2): 491/619 kB | 176/245 kB
Progress (2): 491/619 kB | 180/245 kB
Progress (2): 491/619 kB | 184/245 kB
Progress (2): 491/619 kB | 188/245 kB
Progress (2): 491/619 kB | 193/245 kB
Progress (2): 495/619 kB | 193/245 kB
Progress (2): 495/619 kB | 197/245 kB
Progress (2): 499/619 kB | 197/245 kB
Progress (2): 503/619 kB | 197/245 kB
Progress (2): 507/619 kB | 197/245 kB
Progress (2): 507/619 kB | 201/245 kB
Progress (2): 507/619 kB | 205/245 kB
Progress (2): 507/619 kB | 209/245 kB
Progress (2): 507/619 kB | 213/245 kB
Progress (2): 511/619 kB | 213/245 kB
Progress (2): 515/619 kB | 213/245 kB
Progress (2): 520/619 kB | 213/245 kB
Progress (2): 524/619 kB | 213/245 kB
Progress (2): 524/619 kB | 217/245 kB
Progress (2): 524/619 kB | 219/245 kB
Progress (2): 524/619 kB | 223/245 kB
Progress (2): 524/619 kB | 227/245 kB
Progress (2): 524/619 kB | 231/245 kB
Progress (2): 524/619 kB | 235/245 kB
Progress (2): 524/619 kB | 239/245 kB
Progress (2): 524/619 kB | 243/245 kB
Progress (2): 524/619 kB | 245 kB    
Progress (2): 528/619 kB | 245 kB
Progress (2): 532/619 kB | 245 kB
Progress (2): 536/619 kB | 245 kB
Progress (2): 540/619 kB | 245 kB
Progress (2): 544/619 kB | 245 kB
Progress (2): 548/619 kB | 245 kB
Progress (2): 552/619 kB | 245 kB
Progress (2): 556/619 kB | 245 kB
Progress (2): 561/619 kB | 245 kB
Progress (2): 565/619 kB | 245 kB
Progress (2): 569/619 kB | 245 kB
Progress (2): 573/619 kB | 245 kB
Progress (2): 577/619 kB | 245 kB
Progress (2): 581/619 kB | 245 kB
Progress (2): 585/619 kB | 245 kB
Progress (2): 589/619 kB | 245 kB
Progress (2): 593/619 kB | 245 kB
Progress (2): 597/619 kB | 245 kB
Progress (2): 602/619 kB | 245 kB
Progress (2): 606/619 kB | 245 kB
Progress (2): 610/619 kB | 245 kB
Progress (2): 614/619 kB | 245 kB
Progress (2): 618/619 kB | 245 kB
Progress (2): 619 kB | 245 kB    
Progress (3): 619 kB | 245 kB | 4.1/59 kB
Progress (3): 619 kB | 245 kB | 8.2/59 kB
Progress (3): 619 kB | 245 kB | 12/59 kB 
Progress (4): 619 kB | 245 kB | 12/59 kB | 4.1/26 kB
Progress (4): 619 kB | 245 kB | 16/59 kB | 4.1/26 kB
Progress (4): 619 kB | 245 kB | 16/59 kB | 8.2/26 kB
Progress (4): 619 kB | 245 kB | 16/59 kB | 12/26 kB 
Progress (4): 619 kB | 245 kB | 16/59 kB | 16/26 kB
Progress (4): 619 kB | 245 kB | 16/59 kB | 20/26 kB
Progress (4): 619 kB | 245 kB | 16/59 kB | 25/26 kB
Progress (4): 619 kB | 245 kB | 16/59 kB | 26 kB   
Progress (4): 619 kB | 245 kB | 20/59 kB | 26 kB
Progress (4): 619 kB | 245 kB | 25/59 kB | 26 kB
Progress (4): 619 kB | 245 kB | 29/59 kB | 26 kB
Progress (4): 619 kB | 245 kB | 33/59 kB | 26 kB
Progress (4): 619 kB | 245 kB | 37/59 kB | 26 kB
Progress (4): 619 kB | 245 kB | 41/59 kB | 26 kB
Progress (4): 619 kB | 245 kB | 45/59 kB | 26 kB
Progress (4): 619 kB | 245 kB | 49/59 kB | 26 kB
Progress (4): 619 kB | 245 kB | 53/59 kB | 26 kB
Progress (4): 619 kB | 245 kB | 57/59 kB | 26 kB
Progress (4): 619 kB | 245 kB | 59 kB | 26 kB   
Progress (5): 619 kB | 245 kB | 59 kB | 26 kB | 4.1/51 kB
Progress (5): 619 kB | 245 kB | 59 kB | 26 kB | 8.2/51 kB
Progress (5): 619 kB | 245 kB | 59 kB | 26 kB | 12/51 kB 
Progress (5): 619 kB | 245 kB | 59 kB | 26 kB | 16/51 kB
Progress (5): 619 kB | 245 kB | 59 kB | 26 kB | 20/51 kB
Progress (5): 619 kB | 245 kB | 59 kB | 26 kB | 25/51 kB
Progress (5): 619 kB | 245 kB | 59 kB | 26 kB | 29/51 kB
Progress (5): 619 kB | 245 kB | 59 kB | 26 kB | 33/51 kB
Progress (5): 619 kB | 245 kB | 59 kB | 26 kB | 37/51 kB
Progress (5): 619 kB | 245 kB | 59 kB | 26 kB | 41/51 kB
Progress (5): 619 kB | 245 kB | 59 kB | 26 kB | 45/51 kB
Progress (5): 619 kB | 245 kB | 59 kB | 26 kB | 49/51 kB
Progress (5): 619 kB | 245 kB | 59 kB | 26 kB | 51 kB   
                                                     
Downloaded from central: https://repo.maven.apache.org/maven2/ch/ethz/ganymed/ganymed-ssh2/build210/ganymed-ssh2-build210.jar (245 kB at 587 kB/s)
17:56:11 Downloading from central: https://repo.maven.apache.org/maven2/org/apache/maven/scm/maven-scm-provider-local/1.0/maven-scm-provider-local-1.0.jar
17:56:11 Downloaded from central: https://repo.maven.apache.org/maven2/org/netbeans/lib/cvsclient/20060125/cvsclient-20060125.jar (619 kB at 1.4 MB/s)
17:56:11 Downloading from central: https://repo.maven.apache.org/maven2/org/apache/maven/scm/maven-scm-provider-perforce/1.0/maven-scm-provider-perforce-1.0.jar
17:56:11 Downloaded from central: https://repo.maven.apache.org/maven2/org/apache/maven/scm/maven-scm-provider-clearcase/1.0/maven-scm-provider-clearcase-1.0.jar (59 kB at 138 kB/s)
17:56:11 Downloading from central: https://repo.maven.apache.org/maven2/org/apache/maven/scm/maven-scm-provider-starteam/1.0/maven-scm-provider-starteam-1.0.jar
17:56:11 Downloaded from central: https://repo.maven.apache.org/maven2/org/apache/maven/scm/maven-scm-provider-hg/1.0/maven-scm-provider-hg-1.0.jar (51 kB at 117 kB/s)
17:56:11 Downloaded from central: https://repo.maven.apache.org/maven2/org/apache/maven/scm/maven-scm-provider-cvsexe/1.0/maven-scm-provider-cvsexe-1.0.jar (26 kB at 59 kB/s)
17:56:11 Downloading from central: https://repo.maven.apache.org/maven2/org/apache/maven/scm/maven-scm-provider-svnexe/1.0/maven-scm-provider-svnexe-1.0.jar
17:56:11 Downloading from central: https://repo.maven.apache.org/maven2/org/apache/maven/scm/maven-scm-provider-svn-commons/1.0/maven-scm-provider-svn-commons-1.0.jar
17:56:11 Progress (1): 4.1/40 kB
Progress (1): 8.2/40 kB
Progress (1): 12/40 kB 
Progress (1): 16/40 kB
Progress (1): 20/40 kB
Progress (1): 25/40 kB
Progress (1): 29/40 kB
Progress (1): 33/40 kB
Progress (1): 37/40 kB
Progress (1): 40 kB   
Progress (2): 40 kB | 4.1/58 kB
Progress (3): 40 kB | 4.1/58 kB | 4.1/36 kB
Progress (3): 40 kB | 8.2/58 kB | 4.1/36 kB
Progress (3): 40 kB | 12/58 kB | 4.1/36 kB 
Progress (3): 40 kB | 12/58 kB | 8.2/36 kB
Progress (3): 40 kB | 16/58 kB | 8.2/36 kB
Progress (3): 40 kB | 16/58 kB | 12/36 kB 
Progress (3): 40 kB | 16/58 kB | 16/36 kB
Progress (3): 40 kB | 20/58 kB | 16/36 kB
Progress (3): 40 kB | 25/58 kB | 16/36 kB
Progress (3): 40 kB | 29/58 kB | 16/36 kB
Progress (3): 40 kB | 33/58 kB | 16/36 kB
Progress (3): 40 kB | 33/58 kB | 20/36 kB
Progress (3): 40 kB | 33/58 kB | 25/36 kB
Progress (3): 40 kB | 37/58 kB | 25/36 kB
Progress (3): 40 kB | 37/58 kB | 29/36 kB
Progress (3): 40 kB | 41/58 kB | 29/36 kB
Progress (3): 40 kB | 41/58 kB | 33/36 kB
Progress (3): 40 kB | 45/58 kB | 33/36 kB
Progress (3): 40 kB | 45/58 kB | 36 kB   
Progress (3): 40 kB | 49/58 kB | 36 kB
Progress (3): 40 kB | 53/58 kB | 36 kB
Progress (3): 40 kB | 57/58 kB | 36 kB
Progress (3): 40 kB | 58 kB | 36 kB   
                                   
Downloaded from central: https://repo.maven.apache.org/maven2/org/apache/maven/scm/maven-scm-provider-svn-commons/1.0/maven-scm-provider-svn-commons-1.0.jar (36 kB at 73 kB/s)
17:56:11 Downloading from central: https://repo.maven.apache.org/maven2/org/apache/maven/scm/maven-scm-provider-synergy/1.0/maven-scm-provider-synergy-1.0.jar
17:56:11 Downloaded from central: https://repo.maven.apache.org/maven2/org/apache/maven/scm/maven-scm-provider-local/1.0/maven-scm-provider-local-1.0.jar (40 kB at 77 kB/s)
17:56:11 Downloading from central: https://repo.maven.apache.org/maven2/org/apache/maven/scm/maven-scm-provider-vss/1.0/maven-scm-provider-vss-1.0.jar
17:56:11 Progress (2): 58 kB | 4.1/63 kB
Progress (2): 58 kB | 8.2/63 kB
Progress (2): 58 kB | 12/63 kB 
Progress (2): 58 kB | 16/63 kB
Progress (2): 58 kB | 20/63 kB
Progress (2): 58 kB | 25/63 kB
Progress (2): 58 kB | 29/63 kB
Progress (2): 58 kB | 33/63 kB
Progress (2): 58 kB | 37/63 kB
Progress (2): 58 kB | 41/63 kB
Progress (2): 58 kB | 45/63 kB
Progress (2): 58 kB | 49/63 kB
Progress (2): 58 kB | 53/63 kB
Progress (2): 58 kB | 57/63 kB
Progress (2): 58 kB | 61/63 kB
Progress (2): 58 kB | 63 kB   
                           
Downloaded from central: https://repo.maven.apache.org/maven2/org/apache/maven/scm/maven-scm-provider-svnexe/1.0/maven-scm-provider-svnexe-1.0.jar (58 kB at 100 kB/s)
17:56:11 Progress (2): 63 kB | 4.1/69 kB
Progress (2): 63 kB | 8.2/69 kB
Progress (2): 63 kB | 12/69 kB 
Progress (2): 63 kB | 16/69 kB
Progress (2): 63 kB | 20/69 kB
Progress (2): 63 kB | 25/69 kB
Progress (2): 63 kB | 29/69 kB
Progress (2): 63 kB | 33/69 kB
Progress (2): 63 kB | 37/69 kB
Progress (2): 63 kB | 41/69 kB
Progress (2): 63 kB | 45/69 kB
Progress (2): 63 kB | 49/69 kB
Progress (2): 63 kB | 53/69 kB
Progress (2): 63 kB | 57/69 kB
Progress (2): 63 kB | 61/69 kB
Progress (2): 63 kB | 66/69 kB
Progress (2): 63 kB | 69 kB   
Progress (3): 63 kB | 69 kB | 4.1/50 kB
Progress (3): 63 kB | 69 kB | 8.2/50 kB
Progress (3): 63 kB | 69 kB | 12/50 kB 
Progress (3): 63 kB | 69 kB | 16/50 kB
Progress (3): 63 kB | 69 kB | 20/50 kB
Progress (3): 63 kB | 69 kB | 25/50 kB
Progress (3): 63 kB | 69 kB | 29/50 kB
Progress (3): 63 kB | 69 kB | 33/50 kB
Progress (3): 63 kB | 69 kB | 37/50 kB
Progress (3): 63 kB | 69 kB | 41/50 kB
Progress (3): 63 kB | 69 kB | 45/50 kB
Progress (3): 63 kB | 69 kB | 49/50 kB
Progress (3): 63 kB | 69 kB | 50 kB   
Progress (4): 63 kB | 69 kB | 50 kB | 4.1/54 kB
Progress (4): 63 kB | 69 kB | 50 kB | 8.2/54 kB
Progress (4): 63 kB | 69 kB | 50 kB | 12/54 kB 
Progress (4): 63 kB | 69 kB | 50 kB | 16/54 kB
Progress (4): 63 kB | 69 kB | 50 kB | 20/54 kB
Progress (4): 63 kB | 69 kB | 50 kB | 25/54 kB
Progress (4): 63 kB | 69 kB | 50 kB | 29/54 kB
Progress (4): 63 kB | 69 kB | 50 kB | 33/54 kB
Progress (4): 63 kB | 69 kB | 50 kB | 37/54 kB
Progress (4): 63 kB | 69 kB | 50 kB | 41/54 kB
Progress (4): 63 kB | 69 kB | 50 kB | 45/54 kB
Progress (4): 63 kB | 69 kB | 50 kB | 49/54 kB
Progress (4): 63 kB | 69 kB | 50 kB | 53/54 kB
Progress (4): 63 kB | 69 kB | 50 kB | 54 kB   
                                           
Downloaded from central: https://repo.maven.apache.org/maven2/org/apache/maven/scm/maven-scm-provider-perforce/1.0/maven-scm-provider-perforce-1.0.jar (63 kB at 95 kB/s)
17:56:11 Downloaded from central: https://repo.maven.apache.org/maven2/org/apache/maven/scm/maven-scm-provider-starteam/1.0/maven-scm-provider-starteam-1.0.jar (69 kB at 97 kB/s)
17:56:11 Downloaded from central: https://repo.maven.apache.org/maven2/org/apache/maven/scm/maven-scm-provider-synergy/1.0/maven-scm-provider-synergy-1.0.jar (50 kB at 68 kB/s)
17:56:11 Downloaded from central: https://repo.maven.apache.org/maven2/org/apache/maven/scm/maven-scm-provider-vss/1.0/maven-scm-provider-vss-1.0.jar (54 kB at 71 kB/s)
17:56:11 [INFO] Removing C:\Users\vagrant\elexis\rcptt\elexis-vorlagen
17:56:11 [INFO] Executing: cmd.exe /X /C "git clone https://github.com/ngiger/elexis-vorlagen.git C:\Users\vagrant\elexis\rcptt\elexis-vorlagen"
17:56:11 [INFO] Working directory: C:\Users\vagrant\elexis\rcptt
17:56:11 [ERROR] Provider message:
17:56:11 [ERROR] The git-clone command failed.
17:56:11 [ERROR] Command output:
17:56:11 [ERROR] 'git' is not recognized as an internal or external command,
17:56:11 operable program or batch file.
17:56:11 
17:56:11 [INFO] ------------------------------------------------------------------------
17:56:11 [INFO] Reactor Summary:
17:56:11 [INFO] 
17:56:11 [INFO] elexis-master 3.9 .................................. SUCCESS [02:27 min]
17:56:11 [INFO] setup 0.1 .......................................... FAILURE [01:38 min]
17:56:11 [INFO] KernFunktionen 0.1 ................................. SKIPPED
17:56:11 [INFO] h2 0.1 ............................................. SKIPPED
17:56:11 [INFO] ------------------------------------------------------------------------
17:56:11 [INFO] BUILD FAILURE
17:56:11 [INFO] ------------------------------------------------------------------------
17:56:11 [INFO] Total time:  11:42 min
17:56:11 [INFO] Finished at: 2021-06-08T15:56:13Z
17:56:11 [INFO] ------------------------------------------------------------------------
17:56:11 [ERROR] Failed to execute goal org.apache.maven.plugins:maven-scm-plugin:1.0:checkout (checkout) on project setup: Command failed.The git-clone command failed. -> [Help 1]
17:56:11 [ERROR] 
17:56:11 [ERROR] To see the full stack trace of the errors, re-run Maven with the -e switch.
17:56:11 [ERROR] Re-run Maven using the -X switch to enable full debug logging.
17:56:11 [ERROR] 
17:56:11 [ERROR] For more information about the errors and possible solutions, please read the following articles:
17:56:11 [ERROR] [Help 1] http://cwiki.apache.org/confluence/display/MAVEN/MojoExecutionException
17:56:11 [ERROR] 
17:56:11 [ERROR] After correcting the problems, you can resume the build with the command
17:56:11 [ERROR]   mvn <goals> -rf :setup
17:56:11 Build step 'Maven Goals aufrufen' marked build as failure
17:56:12 Archiviere Artefakte
17:56:13 Started calculate disk usage of build
17:56:14 Finished Calculation of disk usage of build in 0 seconds
17:56:14 Started calculate disk usage of workspace
17:56:14 Finished Calculation of disk usage of workspace in  1 second
17:56:15 Finished: FAILURE